Skip to content

HTTPS clone URL

Subversion checkout URL

You can clone with HTTPS or Subversion.

Download ZIP
branch: master
Fetching contributors…

Cannot retrieve contributors at this time

executable file 4109 lines (4084 sloc) 121.867 kb
This file contains any messages produced by compilers while
running configure, to aid debugging if configure makes a mistake.
It was created by vertex configure 0.10, which was
generated by GNU Autoconf 2.59. Invocation command line was
$ ./configure
## --------- ##
## Platform. ##
## --------- ##
hostname = greghub
uname -m = i686
uname -r = 2.6.18-194.32.1.el5.9p
uname -s = Linux
uname -v = #1 SMP Thu Mar 10 07:21:32 EST 2011
/usr/bin/uname -p = unknown
/bin/uname -X = unknown
/bin/arch = i686
/usr/bin/arch -k = unknown
/usr/convex/getsysinfo = unknown
hostinfo = unknown
/bin/machine = unknown
/usr/bin/oslevel = unknown
/bin/universe = unknown
PATH: /usr/kerberos/bin
PATH: /usr/local/bin
PATH: /bin
PATH: /usr/bin
PATH: /home/amjad/bin
## ----------- ##
## Core tests. ##
## ----------- ##
configure:1375: checking for a BSD-compatible install
configure:1430: result: /usr/bin/install -c
configure:1441: checking whether build environment is sane
configure:1484: result: yes
configure:1549: checking for gawk
configure:1565: found /bin/gawk
configure:1575: result: gawk
configure:1585: checking whether make sets $(MAKE)
configure:1605: result: yes
configure:1830: checking for g++
configure:1846: found /usr/bin/g++
configure:1856: result: g++
configure:1872: checking for C++ compiler version
configure:1875: g++ --version </dev/null >&5
g++ (GCC) 4.1.2 20080704 (Red Hat 4.1.2-48)
Copyright (C) 2006 Free Software Foundation, Inc.
This is free software; see the source for copying conditions. There is NO
warranty; not even for MERCHANTABILITY or FITNESS FOR A PARTICULAR PURPOSE.
configure:1878: $? = 0
configure:1880: g++ -v </dev/null >&5
Using built-in specs.
Target: i386-redhat-linux
Configured with: ../configure --prefix=/usr --mandir=/usr/share/man --infodir=/usr/share/info --enable-shared --enable-threads=posix --enable-checking=release --with-system-zlib --enable-__cxa_atexit --disable-libunwind-exceptions --enable-libgcj-multifile --enable-languages=c,c++,objc,obj-c++,java,fortran,ada --enable-java-awt=gtk --disable-dssi --enable-plugin --with-java-home=/usr/lib/jvm/java-1.4.2-gcj-1.4.2.0/jre --with-cpu=generic --host=i386-redhat-linux
Thread model: posix
gcc version 4.1.2 20080704 (Red Hat 4.1.2-48)
configure:1883: $? = 0
configure:1885: g++ -V </dev/null >&5
g++: '-V' option must have argument
configure:1888: $? = 1
configure:1911: checking for C++ compiler default output file name
configure:1914: g++ conftest.cc >&5
configure:1917: $? = 0
configure:1963: result: a.out
configure:1968: checking whether the C++ compiler works
configure:1974: ./a.out
configure:1977: $? = 0
configure:1994: result: yes
configure:2001: checking whether we are cross compiling
configure:2003: result: no
configure:2006: checking for suffix of executables
configure:2008: g++ -o conftest conftest.cc >&5
configure:2011: $? = 0
configure:2036: result:
configure:2042: checking for suffix of object files
configure:2063: g++ -c conftest.cc >&5
configure:2066: $? = 0
configure:2088: result: o
configure:2092: checking whether we are using the GNU C++ compiler
configure:2116: g++ -c conftest.cc >&5
configure:2122: $? = 0
configure:2126: test -z
|| test ! -s conftest.err
configure:2129: $? = 0
configure:2132: test -s conftest.o
configure:2135: $? = 0
configure:2148: result: yes
configure:2154: checking whether g++ accepts -g
configure:2175: g++ -c -g conftest.cc >&5
configure:2181: $? = 0
configure:2185: test -z
|| test ! -s conftest.err
configure:2188: $? = 0
configure:2191: test -s conftest.o
configure:2194: $? = 0
configure:2205: result: yes
configure:2247: g++ -c -g -O2 conftest.cc >&5
configure:2253: $? = 0
configure:2257: test -z
|| test ! -s conftest.err
configure:2260: $? = 0
configure:2263: test -s conftest.o
configure:2266: $? = 0
configure:2292: g++ -c -g -O2 conftest.cc >&5
conftest.cc: In function 'int main()':
conftest.cc:15: error: 'exit' was not declared in this scope
configure:2298: $? = 1
configure: failed program was:
| /* confdefs.h. */
|
| #define PACKAGE_NAME "vertex"
| #define PACKAGE_TARNAME "vertex"
| #define PACKAGE_VERSION "0.10"
| #define PACKAGE_STRING "vertex 0.10"
| #define PACKAGE_BUGREPORT "openvertex@googlegroups.com"
| #define PACKAGE "vertex"
| #define VERSION "0.10"
| /* end confdefs.h. */
|
| int
| main ()
| {
| exit (42);
| ;
| return 0;
| }
configure:2247: g++ -c -g -O2 conftest.cc >&5
configure:2253: $? = 0
configure:2257: test -z
|| test ! -s conftest.err
configure:2260: $? = 0
configure:2263: test -s conftest.o
configure:2266: $? = 0
configure:2292: g++ -c -g -O2 conftest.cc >&5
configure:2298: $? = 0
configure:2302: test -z
|| test ! -s conftest.err
configure:2305: $? = 0
configure:2308: test -s conftest.o
configure:2311: $? = 0
configure:2345: checking for style of include used by make
configure:2373: result: GNU
configure:2401: checking dependency style of g++
configure:2491: result: gcc3
configure:2512: checking for gawk
configure:2538: result: gawk
configure:2552: checking for bison
configure:2568: found /usr/bin/bison
configure:2578: result: bison -y
configure:2635: checking for gcc
configure:2651: found /usr/bin/gcc
configure:2661: result: gcc
configure:2905: checking for C compiler version
configure:2908: gcc --version </dev/null >&5
gcc (GCC) 4.1.2 20080704 (Red Hat 4.1.2-48)
Copyright (C) 2006 Free Software Foundation, Inc.
This is free software; see the source for copying conditions. There is NO
warranty; not even for MERCHANTABILITY or FITNESS FOR A PARTICULAR PURPOSE.
configure:2911: $? = 0
configure:2913: gcc -v </dev/null >&5
Using built-in specs.
Target: i386-redhat-linux
Configured with: ../configure --prefix=/usr --mandir=/usr/share/man --infodir=/usr/share/info --enable-shared --enable-threads=posix --enable-checking=release --with-system-zlib --enable-__cxa_atexit --disable-libunwind-exceptions --enable-libgcj-multifile --enable-languages=c,c++,objc,obj-c++,java,fortran,ada --enable-java-awt=gtk --disable-dssi --enable-plugin --with-java-home=/usr/lib/jvm/java-1.4.2-gcj-1.4.2.0/jre --with-cpu=generic --host=i386-redhat-linux
Thread model: posix
gcc version 4.1.2 20080704 (Red Hat 4.1.2-48)
configure:2916: $? = 0
configure:2918: gcc -V </dev/null >&5
gcc: '-V' option must have argument
configure:2921: $? = 1
configure:2924: checking whether we are using the GNU C compiler
configure:2948: gcc -c conftest.c >&5
configure:2954: $? = 0
configure:2958: test -z
|| test ! -s conftest.err
configure:2961: $? = 0
configure:2964: test -s conftest.o
configure:2967: $? = 0
configure:2980: result: yes
configure:2986: checking whether gcc accepts -g
configure:3007: gcc -c -g conftest.c >&5
configure:3013: $? = 0
configure:3017: test -z
|| test ! -s conftest.err
configure:3020: $? = 0
configure:3023: test -s conftest.o
configure:3026: $? = 0
configure:3037: result: yes
configure:3054: checking for gcc option to accept ANSI C
configure:3124: gcc -c -g -O2 conftest.c >&5
configure:3130: $? = 0
configure:3134: test -z
|| test ! -s conftest.err
configure:3137: $? = 0
configure:3140: test -s conftest.o
configure:3143: $? = 0
configure:3161: result: none needed
configure:3179: gcc -c -g -O2 conftest.c >&5
conftest.c:2: error: expected '=', ',', ';', 'asm' or '__attribute__' before 'me'
configure:3185: $? = 1
configure: failed program was:
| #ifndef __cplusplus
| choke me
| #endif
configure:3320: checking dependency style of gcc
configure:3410: result: gcc3
configure:3432: checking for flex
configure:3448: found /usr/bin/flex
configure:3458: result: flex
configure:3471: checking for yywrap in -lfl
configure:3501: gcc -o conftest -g -O2 conftest.c -lfl >&5
configure:3507: $? = 0
configure:3511: test -z
|| test ! -s conftest.err
configure:3514: $? = 0
configure:3517: test -s conftest
configure:3520: $? = 0
configure:3533: result: yes
configure:3611: checking lex output file root
configure:3622: flex conftest.l
configure:3625: $? = 0
configure:3637: result: lex.yy
configure:3642: checking whether yytext is a pointer
configure:3658: gcc -o conftest -g -O2 conftest.c -lfl >&5
configure:3664: $? = 0
configure:3668: test -z
|| test ! -s conftest.err
configure:3671: $? = 0
configure:3674: test -s conftest
configure:3677: $? = 0
configure:3691: result: yes
configure:3703: checking whether ln -s works
configure:3707: result: yes
configure:3714: checking whether make sets $(MAKE)
configure:3734: result: yes
configure:3784: checking for ranlib
configure:3800: found /usr/bin/ranlib
configure:3811: result: ranlib
configure:3824: checking whether gcc and cc understand -c and -o together
configure:3854: gcc -c conftest.c -o conftest.o >&5
configure:3857: $? = 0
configure:3859: gcc -c conftest.c -o conftest.o >&5
configure:3862: $? = 0
configure:3869: cc -c conftest.c >&5
configure:3872: $? = 0
configure:3875: cc -c conftest.c -o conftest.o >&5
configure:3878: $? = 0
configure:3880: cc -c conftest.c -o conftest.o >&5
configure:3883: $? = 0
configure:3901: result: yes
configure:3927: checking checking for 9p support in kernel
configure:3949: kernel with 9p support is installed
configure:4026: checking for main in -laio
configure:4050: gcc -o conftest -g -O2 conftest.c -laio >&5
configure:4056: $? = 0
configure:4060: test -z
|| test ! -s conftest.err
configure:4063: $? = 0
configure:4066: test -s conftest
configure:4069: $? = 0
configure:4082: result: yes
configure:4085: libaio-devel is installed
configure:4165: checking for dirent.h that defines DIR
configure:4189: gcc -c -g -O2 conftest.c >&5
configure:4195: $? = 0
configure:4199: test -z
|| test ! -s conftest.err
configure:4202: $? = 0
configure:4205: test -s conftest.o
configure:4208: $? = 0
configure:4219: result: yes
configure:4232: checking for library containing opendir
configure:4262: gcc -o conftest -g -O2 conftest.c >&5
configure:4268: $? = 0
configure:4272: test -z
|| test ! -s conftest.err
configure:4275: $? = 0
configure:4278: test -s conftest
configure:4281: $? = 0
configure:4351: result: none required
configure:4492: checking how to run the C preprocessor
configure:4527: gcc -E conftest.c
configure:4533: $? = 0
configure:4565: gcc -E conftest.c
conftest.c:16:28: error: ac_nonexistent.h: No such file or directory
configure:4571: $? = 1
configure: failed program was:
| /* confdefs.h. */
|
| #define PACKAGE_NAME "vertex"
| #define PACKAGE_TARNAME "vertex"
| #define PACKAGE_VERSION "0.10"
| #define PACKAGE_STRING "vertex 0.10"
| #define PACKAGE_BUGREPORT "openvertex@googlegroups.com"
| #define PACKAGE "vertex"
| #define VERSION "0.10"
| #ifdef __cplusplus
| extern "C" void std::exit (int) throw (); using std::exit;
| #endif
| #define YYTEXT_POINTER 1
| #define HAVE_DIRENT_H 1
| /* end confdefs.h. */
| #include <ac_nonexistent.h>
configure:4610: result: gcc -E
configure:4634: gcc -E conftest.c
configure:4640: $? = 0
configure:4672: gcc -E conftest.c
conftest.c:16:28: error: ac_nonexistent.h: No such file or directory
configure:4678: $? = 1
configure: failed program was:
| /* confdefs.h. */
|
| #define PACKAGE_NAME "vertex"
| #define PACKAGE_TARNAME "vertex"
| #define PACKAGE_VERSION "0.10"
| #define PACKAGE_STRING "vertex 0.10"
| #define PACKAGE_BUGREPORT "openvertex@googlegroups.com"
| #define PACKAGE "vertex"
| #define VERSION "0.10"
| #ifdef __cplusplus
| extern "C" void std::exit (int) throw (); using std::exit;
| #endif
| #define YYTEXT_POINTER 1
| #define HAVE_DIRENT_H 1
| /* end confdefs.h. */
| #include <ac_nonexistent.h>
configure:4722: checking for egrep
configure:4732: result: grep -E
configure:4737: checking for ANSI C header files
configure:4762: gcc -c -g -O2 conftest.c >&5
configure:4768: $? = 0
configure:4772: test -z
|| test ! -s conftest.err
configure:4775: $? = 0
configure:4778: test -s conftest.o
configure:4781: $? = 0
configure:4870: gcc -o conftest -g -O2 conftest.c >&5
conftest.c: In function 'main':
conftest.c:33: warning: incompatible implicit declaration of built-in function 'exit'
configure:4873: $? = 0
configure:4875: ./conftest
configure:4878: $? = 0
configure:4893: result: yes
configure:4917: checking for sys/types.h
configure:4933: gcc -c -g -O2 conftest.c >&5
configure:4939: $? = 0
configure:4943: test -z
|| test ! -s conftest.err
configure:4946: $? = 0
configure:4949: test -s conftest.o
configure:4952: $? = 0
configure:4963: result: yes
configure:4917: checking for sys/stat.h
configure:4933: gcc -c -g -O2 conftest.c >&5
configure:4939: $? = 0
configure:4943: test -z
|| test ! -s conftest.err
configure:4946: $? = 0
configure:4949: test -s conftest.o
configure:4952: $? = 0
configure:4963: result: yes
configure:4917: checking for stdlib.h
configure:4933: gcc -c -g -O2 conftest.c >&5
configure:4939: $? = 0
configure:4943: test -z
|| test ! -s conftest.err
configure:4946: $? = 0
configure:4949: test -s conftest.o
configure:4952: $? = 0
configure:4963: result: yes
configure:4917: checking for string.h
configure:4933: gcc -c -g -O2 conftest.c >&5
configure:4939: $? = 0
configure:4943: test -z
|| test ! -s conftest.err
configure:4946: $? = 0
configure:4949: test -s conftest.o
configure:4952: $? = 0
configure:4963: result: yes
configure:4917: checking for memory.h
configure:4933: gcc -c -g -O2 conftest.c >&5
configure:4939: $? = 0
configure:4943: test -z
|| test ! -s conftest.err
configure:4946: $? = 0
configure:4949: test -s conftest.o
configure:4952: $? = 0
configure:4963: result: yes
configure:4917: checking for strings.h
configure:4933: gcc -c -g -O2 conftest.c >&5
configure:4939: $? = 0
configure:4943: test -z
|| test ! -s conftest.err
configure:4946: $? = 0
configure:4949: test -s conftest.o
configure:4952: $? = 0
configure:4963: result: yes
configure:4917: checking for inttypes.h
configure:4933: gcc -c -g -O2 conftest.c >&5
configure:4939: $? = 0
configure:4943: test -z
|| test ! -s conftest.err
configure:4946: $? = 0
configure:4949: test -s conftest.o
configure:4952: $? = 0
configure:4963: result: yes
configure:4917: checking for stdint.h
configure:4933: gcc -c -g -O2 conftest.c >&5
configure:4939: $? = 0
configure:4943: test -z
|| test ! -s conftest.err
configure:4946: $? = 0
configure:4949: test -s conftest.o
configure:4952: $? = 0
configure:4963: result: yes
configure:4917: checking for unistd.h
configure:4933: gcc -c -g -O2 conftest.c >&5
configure:4939: $? = 0
configure:4943: test -z
|| test ! -s conftest.err
configure:4946: $? = 0
configure:4949: test -s conftest.o
configure:4952: $? = 0
configure:4963: result: yes
configure:4975: checking whether sys/types.h defines makedev
configure:4996: gcc -o conftest -g -O2 conftest.c >&5
configure:5002: $? = 0
configure:5006: test -z
|| test ! -s conftest.err
configure:5009: $? = 0
configure:5012: test -s conftest
configure:5015: $? = 0
configure:5028: result: yes
configure:5329: checking for sys/wait.h that is POSIX.1 compatible
configure:5360: gcc -c -g -O2 conftest.c >&5
configure:5366: $? = 0
configure:5370: test -z
|| test ! -s conftest.err
configure:5373: $? = 0
configure:5376: test -s conftest.o
configure:5379: $? = 0
configure:5390: result: yes
configure:5442: checking arpa/inet.h usability
configure:5454: gcc -c -g -O2 conftest.c >&5
configure:5460: $? = 0
configure:5464: test -z
|| test ! -s conftest.err
configure:5467: $? = 0
configure:5470: test -s conftest.o
configure:5473: $? = 0
configure:5483: result: yes
configure:5487: checking arpa/inet.h presence
configure:5497: gcc -E conftest.c
configure:5503: $? = 0
configure:5523: result: yes
configure:5558: checking for arpa/inet.h
configure:5565: result: yes
configure:5442: checking fcntl.h usability
configure:5454: gcc -c -g -O2 conftest.c >&5
configure:5460: $? = 0
configure:5464: test -z
|| test ! -s conftest.err
configure:5467: $? = 0
configure:5470: test -s conftest.o
configure:5473: $? = 0
configure:5483: result: yes
configure:5487: checking fcntl.h presence
configure:5497: gcc -E conftest.c
configure:5503: $? = 0
configure:5523: result: yes
configure:5558: checking for fcntl.h
configure:5565: result: yes
configure:5433: checking for inttypes.h
configure:5438: result: yes
configure:5442: checking limits.h usability
configure:5454: gcc -c -g -O2 conftest.c >&5
configure:5460: $? = 0
configure:5464: test -z
|| test ! -s conftest.err
configure:5467: $? = 0
configure:5470: test -s conftest.o
configure:5473: $? = 0
configure:5483: result: yes
configure:5487: checking limits.h presence
configure:5497: gcc -E conftest.c
configure:5503: $? = 0
configure:5523: result: yes
configure:5558: checking for limits.h
configure:5565: result: yes
configure:5442: checking locale.h usability
configure:5454: gcc -c -g -O2 conftest.c >&5
configure:5460: $? = 0
configure:5464: test -z
|| test ! -s conftest.err
configure:5467: $? = 0
configure:5470: test -s conftest.o
configure:5473: $? = 0
configure:5483: result: yes
configure:5487: checking locale.h presence
configure:5497: gcc -E conftest.c
configure:5503: $? = 0
configure:5523: result: yes
configure:5558: checking for locale.h
configure:5565: result: yes
configure:5442: checking mntent.h usability
configure:5454: gcc -c -g -O2 conftest.c >&5
configure:5460: $? = 0
configure:5464: test -z
|| test ! -s conftest.err
configure:5467: $? = 0
configure:5470: test -s conftest.o
configure:5473: $? = 0
configure:5483: result: yes
configure:5487: checking mntent.h presence
configure:5497: gcc -E conftest.c
configure:5503: $? = 0
configure:5523: result: yes
configure:5558: checking for mntent.h
configure:5565: result: yes
configure:5442: checking netdb.h usability
configure:5454: gcc -c -g -O2 conftest.c >&5
configure:5460: $? = 0
configure:5464: test -z
|| test ! -s conftest.err
configure:5467: $? = 0
configure:5470: test -s conftest.o
configure:5473: $? = 0
configure:5483: result: yes
configure:5487: checking netdb.h presence
configure:5497: gcc -E conftest.c
configure:5503: $? = 0
configure:5523: result: yes
configure:5558: checking for netdb.h
configure:5565: result: yes
configure:5442: checking netinet/in.h usability
configure:5454: gcc -c -g -O2 conftest.c >&5
configure:5460: $? = 0
configure:5464: test -z
|| test ! -s conftest.err
configure:5467: $? = 0
configure:5470: test -s conftest.o
configure:5473: $? = 0
configure:5483: result: yes
configure:5487: checking netinet/in.h presence
configure:5497: gcc -E conftest.c
configure:5503: $? = 0
configure:5523: result: yes
configure:5558: checking for netinet/in.h
configure:5565: result: yes
configure:5442: checking paths.h usability
configure:5454: gcc -c -g -O2 conftest.c >&5
configure:5460: $? = 0
configure:5464: test -z
|| test ! -s conftest.err
configure:5467: $? = 0
configure:5470: test -s conftest.o
configure:5473: $? = 0
configure:5483: result: yes
configure:5487: checking paths.h presence
configure:5497: gcc -E conftest.c
configure:5503: $? = 0
configure:5523: result: yes
configure:5558: checking for paths.h
configure:5565: result: yes
configure:5442: checking shadow.h usability
configure:5454: gcc -c -g -O2 conftest.c >&5
configure:5460: $? = 0
configure:5464: test -z
|| test ! -s conftest.err
configure:5467: $? = 0
configure:5470: test -s conftest.o
configure:5473: $? = 0
configure:5483: result: yes
configure:5487: checking shadow.h presence
configure:5497: gcc -E conftest.c
configure:5503: $? = 0
configure:5523: result: yes
configure:5558: checking for shadow.h
configure:5565: result: yes
configure:5442: checking stddef.h usability
configure:5454: gcc -c -g -O2 conftest.c >&5
configure:5460: $? = 0
configure:5464: test -z
|| test ! -s conftest.err
configure:5467: $? = 0
configure:5470: test -s conftest.o
configure:5473: $? = 0
configure:5483: result: yes
configure:5487: checking stddef.h presence
configure:5497: gcc -E conftest.c
configure:5503: $? = 0
configure:5523: result: yes
configure:5558: checking for stddef.h
configure:5565: result: yes
configure:5433: checking for stdint.h
configure:5438: result: yes
configure:5433: checking for stdlib.h
configure:5438: result: yes
configure:5433: checking for string.h
configure:5438: result: yes
configure:5433: checking for strings.h
configure:5438: result: yes
configure:5442: checking sys/file.h usability
configure:5454: gcc -c -g -O2 conftest.c >&5
configure:5460: $? = 0
configure:5464: test -z
|| test ! -s conftest.err
configure:5467: $? = 0
configure:5470: test -s conftest.o
configure:5473: $? = 0
configure:5483: result: yes
configure:5487: checking sys/file.h presence
configure:5497: gcc -E conftest.c
configure:5503: $? = 0
configure:5523: result: yes
configure:5558: checking for sys/file.h
configure:5565: result: yes
configure:5442: checking sys/ioctl.h usability
configure:5454: gcc -c -g -O2 conftest.c >&5
configure:5460: $? = 0
configure:5464: test -z
|| test ! -s conftest.err
configure:5467: $? = 0
configure:5470: test -s conftest.o
configure:5473: $? = 0
configure:5483: result: yes
configure:5487: checking sys/ioctl.h presence
configure:5497: gcc -E conftest.c
configure:5503: $? = 0
configure:5523: result: yes
configure:5558: checking for sys/ioctl.h
configure:5565: result: yes
configure:5442: checking sys/mount.h usability
configure:5454: gcc -c -g -O2 conftest.c >&5
configure:5460: $? = 0
configure:5464: test -z
|| test ! -s conftest.err
configure:5467: $? = 0
configure:5470: test -s conftest.o
configure:5473: $? = 0
configure:5483: result: yes
configure:5487: checking sys/mount.h presence
configure:5497: gcc -E conftest.c
configure:5503: $? = 0
configure:5523: result: yes
configure:5558: checking for sys/mount.h
configure:5565: result: yes
configure:5442: checking sys/param.h usability
configure:5454: gcc -c -g -O2 conftest.c >&5
configure:5460: $? = 0
configure:5464: test -z
|| test ! -s conftest.err
configure:5467: $? = 0
configure:5470: test -s conftest.o
configure:5473: $? = 0
configure:5483: result: yes
configure:5487: checking sys/param.h presence
configure:5497: gcc -E conftest.c
configure:5503: $? = 0
configure:5523: result: yes
configure:5558: checking for sys/param.h
configure:5565: result: yes
configure:5442: checking sys/socket.h usability
configure:5454: gcc -c -g -O2 conftest.c >&5
configure:5460: $? = 0
configure:5464: test -z
|| test ! -s conftest.err
configure:5467: $? = 0
configure:5470: test -s conftest.o
configure:5473: $? = 0
configure:5483: result: yes
configure:5487: checking sys/socket.h presence
configure:5497: gcc -E conftest.c
configure:5503: $? = 0
configure:5523: result: yes
configure:5558: checking for sys/socket.h
configure:5565: result: yes
configure:5442: checking sys/statfs.h usability
configure:5454: gcc -c -g -O2 conftest.c >&5
configure:5460: $? = 0
configure:5464: test -z
|| test ! -s conftest.err
configure:5467: $? = 0
configure:5470: test -s conftest.o
configure:5473: $? = 0
configure:5483: result: yes
configure:5487: checking sys/statfs.h presence
configure:5497: gcc -E conftest.c
configure:5503: $? = 0
configure:5523: result: yes
configure:5558: checking for sys/statfs.h
configure:5565: result: yes
configure:5442: checking sys/statvfs.h usability
configure:5454: gcc -c -g -O2 conftest.c >&5
configure:5460: $? = 0
configure:5464: test -z
|| test ! -s conftest.err
configure:5467: $? = 0
configure:5470: test -s conftest.o
configure:5473: $? = 0
configure:5483: result: yes
configure:5487: checking sys/statvfs.h presence
configure:5497: gcc -E conftest.c
configure:5503: $? = 0
configure:5523: result: yes
configure:5558: checking for sys/statvfs.h
configure:5565: result: yes
configure:5442: checking sys/time.h usability
configure:5454: gcc -c -g -O2 conftest.c >&5
configure:5460: $? = 0
configure:5464: test -z
|| test ! -s conftest.err
configure:5467: $? = 0
configure:5470: test -s conftest.o
configure:5473: $? = 0
configure:5483: result: yes
configure:5487: checking sys/time.h presence
configure:5497: gcc -E conftest.c
configure:5503: $? = 0
configure:5523: result: yes
configure:5558: checking for sys/time.h
configure:5565: result: yes
configure:5442: checking sys/vfs.h usability
configure:5454: gcc -c -g -O2 conftest.c >&5
configure:5460: $? = 0
configure:5464: test -z
|| test ! -s conftest.err
configure:5467: $? = 0
configure:5470: test -s conftest.o
configure:5473: $? = 0
configure:5483: result: yes
configure:5487: checking sys/vfs.h presence
configure:5497: gcc -E conftest.c
configure:5503: $? = 0
configure:5523: result: yes
configure:5558: checking for sys/vfs.h
configure:5565: result: yes
configure:5442: checking syslog.h usability
configure:5454: gcc -c -g -O2 conftest.c >&5
configure:5460: $? = 0
configure:5464: test -z
|| test ! -s conftest.err
configure:5467: $? = 0
configure:5470: test -s conftest.o
configure:5473: $? = 0
configure:5483: result: yes
configure:5487: checking syslog.h presence
configure:5497: gcc -E conftest.c
configure:5503: $? = 0
configure:5523: result: yes
configure:5558: checking for syslog.h
configure:5565: result: yes
configure:5442: checking termios.h usability
configure:5454: gcc -c -g -O2 conftest.c >&5
configure:5460: $? = 0
configure:5464: test -z
|| test ! -s conftest.err
configure:5467: $? = 0
configure:5470: test -s conftest.o
configure:5473: $? = 0
configure:5483: result: yes
configure:5487: checking termios.h presence
configure:5497: gcc -E conftest.c
configure:5503: $? = 0
configure:5523: result: yes
configure:5558: checking for termios.h
configure:5565: result: yes
configure:5433: checking for unistd.h
configure:5438: result: yes
configure:5442: checking utime.h usability
configure:5454: gcc -c -g -O2 conftest.c >&5
configure:5460: $? = 0
configure:5464: test -z
|| test ! -s conftest.err
configure:5467: $? = 0
configure:5470: test -s conftest.o
configure:5473: $? = 0
configure:5483: result: yes
configure:5487: checking utime.h presence
configure:5497: gcc -E conftest.c
configure:5503: $? = 0
configure:5523: result: yes
configure:5558: checking for utime.h
configure:5565: result: yes
configure:5442: checking utmp.h usability
configure:5454: gcc -c -g -O2 conftest.c >&5
configure:5460: $? = 0
configure:5464: test -z
|| test ! -s conftest.err
configure:5467: $? = 0
configure:5470: test -s conftest.o
configure:5473: $? = 0
configure:5483: result: yes
configure:5487: checking utmp.h presence
configure:5497: gcc -E conftest.c
configure:5503: $? = 0
configure:5523: result: yes
configure:5558: checking for utmp.h
configure:5565: result: yes
configure:5580: checking for stdbool.h that conforms to C99
configure:5633: gcc -c -g -O2 conftest.c >&5
configure:5639: $? = 0
configure:5643: test -z
|| test ! -s conftest.err
configure:5646: $? = 0
configure:5649: test -s conftest.o
configure:5652: $? = 0
configure:5663: result: yes
configure:5665: checking for _Bool
configure:5689: gcc -c -g -O2 conftest.c >&5
configure:5695: $? = 0
configure:5699: test -z
|| test ! -s conftest.err
configure:5702: $? = 0
configure:5705: test -s conftest.o
configure:5708: $? = 0
configure:5719: result: yes
configure:5738: checking for an ANSI C-conforming const
configure:5805: gcc -c -g -O2 conftest.c >&5
configure:5811: $? = 0
configure:5815: test -z
|| test ! -s conftest.err
configure:5818: $? = 0
configure:5821: test -s conftest.o
configure:5824: $? = 0
configure:5835: result: yes
configure:5845: checking for uid_t in sys/types.h
configure:5868: result: yes
configure:5883: checking for inline
configure:5904: gcc -c -g -O2 conftest.c >&5
configure:5910: $? = 0
configure:5914: test -z
|| test ! -s conftest.err
configure:5917: $? = 0
configure:5920: test -s conftest.o
configure:5923: $? = 0
configure:5935: result: inline
configure:5954: checking for mode_t
configure:5978: gcc -c -g -O2 conftest.c >&5
configure:5984: $? = 0
configure:5988: test -z
|| test ! -s conftest.err
configure:5991: $? = 0
configure:5994: test -s conftest.o
configure:5997: $? = 0
configure:6008: result: yes
configure:6020: checking for off_t
configure:6044: gcc -c -g -O2 conftest.c >&5
configure:6050: $? = 0
configure:6054: test -z
|| test ! -s conftest.err
configure:6057: $? = 0
configure:6060: test -s conftest.o
configure:6063: $? = 0
configure:6074: result: yes
configure:6086: checking for pid_t
configure:6110: gcc -c -g -O2 conftest.c >&5
configure:6116: $? = 0
configure:6120: test -z
|| test ! -s conftest.err
configure:6123: $? = 0
configure:6126: test -s conftest.o
configure:6129: $? = 0
configure:6140: result: yes
configure:6152: checking for size_t
configure:6176: gcc -c -g -O2 conftest.c >&5
configure:6182: $? = 0
configure:6186: test -z
|| test ! -s conftest.err
configure:6189: $? = 0
configure:6192: test -s conftest.o
configure:6195: $? = 0
configure:6206: result: yes
configure:6218: checking for struct stat.st_blksize
configure:6241: gcc -c -g -O2 conftest.c >&5
configure:6247: $? = 0
configure:6251: test -z
|| test ! -s conftest.err
configure:6254: $? = 0
configure:6257: test -s conftest.o
configure:6260: $? = 0
configure:6317: result: yes
configure:6328: checking for struct stat.st_blocks
configure:6351: gcc -c -g -O2 conftest.c >&5
configure:6357: $? = 0
configure:6361: test -z
|| test ! -s conftest.err
configure:6364: $? = 0
configure:6367: test -s conftest.o
configure:6370: $? = 0
configure:6427: result: yes
configure:6452: checking for struct stat.st_rdev
configure:6475: gcc -c -g -O2 conftest.c >&5
configure:6481: $? = 0
configure:6485: test -z
|| test ! -s conftest.err
configure:6488: $? = 0
configure:6491: test -s conftest.o
configure:6494: $? = 0
configure:6551: result: yes
configure:6562: checking whether time.h and sys/time.h may both be included
configure:6587: gcc -c -g -O2 conftest.c >&5
configure:6593: $? = 0
configure:6597: test -z
|| test ! -s conftest.err
configure:6600: $? = 0
configure:6603: test -s conftest.o
configure:6606: $? = 0
configure:6617: result: yes
configure:6627: checking whether struct tm is in sys/time.h or time.h
configure:6650: gcc -c -g -O2 conftest.c >&5
configure:6656: $? = 0
configure:6660: test -z
|| test ! -s conftest.err
configure:6663: $? = 0
configure:6666: test -s conftest.o
configure:6669: $? = 0
configure:6680: result: time.h
configure:6690: checking for working volatile
configure:6713: gcc -c -g -O2 conftest.c >&5
configure:6719: $? = 0
configure:6723: test -z
|| test ! -s conftest.err
configure:6726: $? = 0
configure:6729: test -s conftest.o
configure:6732: $? = 0
configure:6743: result: yes
configure:6753: checking for ptrdiff_t
configure:6777: gcc -c -g -O2 conftest.c >&5
configure:6783: $? = 0
configure:6787: test -z
|| test ! -s conftest.err
configure:6790: $? = 0
configure:6793: test -s conftest.o
configure:6796: $? = 0
configure:6807: result: yes
configure:6822: checking for working alloca.h
configure:6843: gcc -o conftest -g -O2 conftest.c >&5
configure:6849: $? = 0
configure:6853: test -z
|| test ! -s conftest.err
configure:6856: $? = 0
configure:6859: test -s conftest
configure:6862: $? = 0
configure:6874: result: yes
configure:6884: checking for alloca
configure:6925: gcc -o conftest -g -O2 conftest.c >&5
configure:6931: $? = 0
configure:6935: test -z
|| test ! -s conftest.err
configure:6938: $? = 0
configure:6941: test -s conftest
configure:6944: $? = 0
configure:6956: result: yes
configure:7184: checking for unistd.h
configure:7189: result: yes
configure:7329: checking for working chown
configure:7368: gcc -o conftest -g -O2 conftest.c >&5
configure:7371: $? = 0
configure:7373: ./conftest
configure:7376: $? = 0
configure:7392: result: yes
configure:7402: checking whether closedir returns void
configure:7431: gcc -o conftest -g -O2 conftest.c >&5
configure:7434: $? = 0
configure:7436: ./conftest
configure:7439: $? = 0
configure:7453: result: no
configure:7463: checking for error_at_line
configure:7484: gcc -o conftest -g -O2 conftest.c >&5
configure:7490: $? = 0
configure:7494: test -z
|| test ! -s conftest.err
configure:7497: $? = 0
configure:7500: test -s conftest
configure:7503: $? = 0
configure:7515: result: yes
configure:7528: checking for mbstate_t
configure:7550: gcc -c -g -O2 conftest.c >&5
configure:7556: $? = 0
configure:7560: test -z
|| test ! -s conftest.err
configure:7563: $? = 0
configure:7566: test -s conftest.o
configure:7569: $? = 0
configure:7580: result: yes
configure:7595: checking for working POSIX fnmatch
configure:7633: gcc -o conftest -g -O2 conftest.c >&5
conftest.c: In function 'main':
conftest.c:77: warning: incompatible implicit declaration of built-in function 'exit'
configure:7636: $? = 0
configure:7638: ./conftest
configure:7641: $? = 0
configure:7655: result: yes
configure:8014: checking for unistd.h
configure:8019: result: yes
configure:8023: checking vfork.h usability
configure:8035: gcc -c -g -O2 conftest.c >&5
conftest.c:104:19: error: vfork.h: No such file or directory
configure:8041: $? = 1
configure: failed program was:
| /* confdefs.h. */
|
| #define PACKAGE_NAME "vertex"
| #define PACKAGE_TARNAME "vertex"
| #define PACKAGE_VERSION "0.10"
| #define PACKAGE_STRING "vertex 0.10"
| #define PACKAGE_BUGREPORT "openvertex@googlegroups.com"
| #define PACKAGE "vertex"
| #define VERSION "0.10"
| #ifdef __cplusplus
| extern "C" void std::exit (int) throw (); using std::exit;
| #endif
| #define YYTEXT_POINTER 1
| #define HAVE_DIRENT_H 1
| #define STDC_HEADERS 1
| #define HAVE_SYS_TYPES_H 1
| #define HAVE_SYS_STAT_H 1
| #define HAVE_STDLIB_H 1
| #define HAVE_STRING_H 1
| #define HAVE_MEMORY_H 1
| #define HAVE_STRINGS_H 1
| #define HAVE_INTTYPES_H 1
| #define HAVE_STDINT_H 1
| #define HAVE_UNISTD_H 1
| #define HAVE_SYS_WAIT_H 1
| #define HAVE_ARPA_INET_H 1
| #define HAVE_FCNTL_H 1
| #define HAVE_INTTYPES_H 1
| #define HAVE_LIMITS_H 1
| #define HAVE_LOCALE_H 1
| #define HAVE_MNTENT_H 1
| #define HAVE_NETDB_H 1
| #define HAVE_NETINET_IN_H 1
| #define HAVE_PATHS_H 1
| #define HAVE_SHADOW_H 1
| #define HAVE_STDDEF_H 1
| #define HAVE_STDINT_H 1
| #define HAVE_STDLIB_H 1
| #define HAVE_STRING_H 1
| #define HAVE_STRINGS_H 1
| #define HAVE_SYS_FILE_H 1
| #define HAVE_SYS_IOCTL_H 1
| #define HAVE_SYS_MOUNT_H 1
| #define HAVE_SYS_PARAM_H 1
| #define HAVE_SYS_SOCKET_H 1
| #define HAVE_SYS_STATFS_H 1
| #define HAVE_SYS_STATVFS_H 1
| #define HAVE_SYS_TIME_H 1
| #define HAVE_SYS_VFS_H 1
| #define HAVE_SYSLOG_H 1
| #define HAVE_TERMIOS_H 1
| #define HAVE_UNISTD_H 1
| #define HAVE_UTIME_H 1
| #define HAVE_UTMP_H 1
| #define HAVE__BOOL 1
| #define HAVE_STDBOOL_H 1
| #define HAVE_STRUCT_STAT_ST_BLKSIZE 1
| #define HAVE_STRUCT_STAT_ST_BLOCKS 1
| #define HAVE_ST_BLOCKS 1
| #define HAVE_STRUCT_STAT_ST_RDEV 1
| #define TIME_WITH_SYS_TIME 1
| #define HAVE_PTRDIFF_T 1
| #define HAVE_ALLOCA_H 1
| #define HAVE_ALLOCA 1
| #define HAVE_UNISTD_H 1
| #define HAVE_CHOWN 1
| #define HAVE_MBSTATE_T 1
| #define HAVE_UNISTD_H 1
| /* end confdefs.h. */
| #include <stdio.h>
| #if HAVE_SYS_TYPES_H
| # include <sys/types.h>
| #endif
| #if HAVE_SYS_STAT_H
| # include <sys/stat.h>
| #endif
| #if STDC_HEADERS
| # include <stdlib.h>
| # include <stddef.h>
| #else
| # if HAVE_STDLIB_H
| # include <stdlib.h>
| # endif
| #endif
| #if HAVE_STRING_H
| # if !STDC_HEADERS && HAVE_MEMORY_H
| # include <memory.h>
| # endif
| # include <string.h>
| #endif
| #if HAVE_STRINGS_H
| # include <strings.h>
| #endif
| #if HAVE_INTTYPES_H
| # include <inttypes.h>
| #else
| # if HAVE_STDINT_H
| # include <stdint.h>
| # endif
| #endif
| #if HAVE_UNISTD_H
| # include <unistd.h>
| #endif
| #include <vfork.h>
configure:8064: result: no
configure:8068: checking vfork.h presence
configure:8078: gcc -E conftest.c
conftest.c:70:19: error: vfork.h: No such file or directory
configure:8084: $? = 1
configure: failed program was:
| /* confdefs.h. */
|
| #define PACKAGE_NAME "vertex"
| #define PACKAGE_TARNAME "vertex"
| #define PACKAGE_VERSION "0.10"
| #define PACKAGE_STRING "vertex 0.10"
| #define PACKAGE_BUGREPORT "openvertex@googlegroups.com"
| #define PACKAGE "vertex"
| #define VERSION "0.10"
| #ifdef __cplusplus
| extern "C" void std::exit (int) throw (); using std::exit;
| #endif
| #define YYTEXT_POINTER 1
| #define HAVE_DIRENT_H 1
| #define STDC_HEADERS 1
| #define HAVE_SYS_TYPES_H 1
| #define HAVE_SYS_STAT_H 1
| #define HAVE_STDLIB_H 1
| #define HAVE_STRING_H 1
| #define HAVE_MEMORY_H 1
| #define HAVE_STRINGS_H 1
| #define HAVE_INTTYPES_H 1
| #define HAVE_STDINT_H 1
| #define HAVE_UNISTD_H 1
| #define HAVE_SYS_WAIT_H 1
| #define HAVE_ARPA_INET_H 1
| #define HAVE_FCNTL_H 1
| #define HAVE_INTTYPES_H 1
| #define HAVE_LIMITS_H 1
| #define HAVE_LOCALE_H 1
| #define HAVE_MNTENT_H 1
| #define HAVE_NETDB_H 1
| #define HAVE_NETINET_IN_H 1
| #define HAVE_PATHS_H 1
| #define HAVE_SHADOW_H 1
| #define HAVE_STDDEF_H 1
| #define HAVE_STDINT_H 1
| #define HAVE_STDLIB_H 1
| #define HAVE_STRING_H 1
| #define HAVE_STRINGS_H 1
| #define HAVE_SYS_FILE_H 1
| #define HAVE_SYS_IOCTL_H 1
| #define HAVE_SYS_MOUNT_H 1
| #define HAVE_SYS_PARAM_H 1
| #define HAVE_SYS_SOCKET_H 1
| #define HAVE_SYS_STATFS_H 1
| #define HAVE_SYS_STATVFS_H 1
| #define HAVE_SYS_TIME_H 1
| #define HAVE_SYS_VFS_H 1
| #define HAVE_SYSLOG_H 1
| #define HAVE_TERMIOS_H 1
| #define HAVE_UNISTD_H 1
| #define HAVE_UTIME_H 1
| #define HAVE_UTMP_H 1
| #define HAVE__BOOL 1
| #define HAVE_STDBOOL_H 1
| #define HAVE_STRUCT_STAT_ST_BLKSIZE 1
| #define HAVE_STRUCT_STAT_ST_BLOCKS 1
| #define HAVE_ST_BLOCKS 1
| #define HAVE_STRUCT_STAT_ST_RDEV 1
| #define TIME_WITH_SYS_TIME 1
| #define HAVE_PTRDIFF_T 1
| #define HAVE_ALLOCA_H 1
| #define HAVE_ALLOCA 1
| #define HAVE_UNISTD_H 1
| #define HAVE_CHOWN 1
| #define HAVE_MBSTATE_T 1
| #define HAVE_UNISTD_H 1
| /* end confdefs.h. */
| #include <vfork.h>
configure:8104: result: no
configure:8139: checking for vfork.h
configure:8146: result: no
configure:8164: checking for fork
configure:8221: gcc -o conftest -g -O2 conftest.c >&5
conftest.c:94: warning: conflicting types for built-in function 'fork'
configure:8227: $? = 0
configure:8231: test -z
|| test ! -s conftest.err
configure:8234: $? = 0
configure:8237: test -s conftest
configure:8240: $? = 0
configure:8252: result: yes
configure:8164: checking for vfork
configure:8221: gcc -o conftest -g -O2 conftest.c >&5
configure:8227: $? = 0
configure:8231: test -z
|| test ! -s conftest.err
configure:8234: $? = 0
configure:8237: test -s conftest
configure:8240: $? = 0
configure:8252: result: yes
configure:8263: checking for working fork
configure:8286: gcc -o conftest -g -O2 conftest.c >&5
conftest.c: In function 'main':
conftest.c:10: warning: incompatible implicit declaration of built-in function 'exit'
configure:8289: $? = 0
configure:8291: ./conftest
configure:8294: $? = 0
configure:8308: result: yes
configure:8329: checking for working vfork
configure:8462: result: yes
configure:8493: checking type of array argument to getgroups
configure:8531: gcc -o conftest -g -O2 conftest.c >&5
conftest.c: In function 'main':
conftest.c:94: warning: incompatible implicit declaration of built-in function 'exit'
configure:8534: $? = 0
configure:8536: ./conftest
configure:8539: $? = 0
configure:8572: result: gid_t
configure:8580: checking for getgroups
configure:8637: gcc -o conftest -g -O2 conftest.c >&5
configure:8643: $? = 0
configure:8647: test -z
|| test ! -s conftest.err
configure:8650: $? = 0
configure:8653: test -s conftest
configure:8656: $? = 0
configure:8668: result: yes
configure:8749: checking for working getgroups
configure:8774: gcc -o conftest -g -O2 conftest.c >&5
configure:8777: $? = 0
configure:8779: ./conftest
configure:8782: $? = 0
configure:8797: result: yes
configure:8810: checking for getmntent in -lsun
configure:8840: gcc -o conftest -g -O2 conftest.c -lsun >&5
/usr/bin/ld: cannot find -lsun
collect2: ld returned 1 exit status
configure:8846: $? = 1
configure: failed program was:
| /* confdefs.h. */
|
| #define PACKAGE_NAME "vertex"
| #define PACKAGE_TARNAME "vertex"
| #define PACKAGE_VERSION "0.10"
| #define PACKAGE_STRING "vertex 0.10"
| #define PACKAGE_BUGREPORT "openvertex@googlegroups.com"
| #define PACKAGE "vertex"
| #define VERSION "0.10"
| #ifdef __cplusplus
| extern "C" void std::exit (int) throw (); using std::exit;
| #endif
| #define YYTEXT_POINTER 1
| #define HAVE_DIRENT_H 1
| #define STDC_HEADERS 1
| #define HAVE_SYS_TYPES_H 1
| #define HAVE_SYS_STAT_H 1
| #define HAVE_STDLIB_H 1
| #define HAVE_STRING_H 1
| #define HAVE_MEMORY_H 1
| #define HAVE_STRINGS_H 1
| #define HAVE_INTTYPES_H 1
| #define HAVE_STDINT_H 1
| #define HAVE_UNISTD_H 1
| #define HAVE_SYS_WAIT_H 1
| #define HAVE_ARPA_INET_H 1
| #define HAVE_FCNTL_H 1
| #define HAVE_INTTYPES_H 1
| #define HAVE_LIMITS_H 1
| #define HAVE_LOCALE_H 1
| #define HAVE_MNTENT_H 1
| #define HAVE_NETDB_H 1
| #define HAVE_NETINET_IN_H 1
| #define HAVE_PATHS_H 1
| #define HAVE_SHADOW_H 1
| #define HAVE_STDDEF_H 1
| #define HAVE_STDINT_H 1
| #define HAVE_STDLIB_H 1
| #define HAVE_STRING_H 1
| #define HAVE_STRINGS_H 1
| #define HAVE_SYS_FILE_H 1
| #define HAVE_SYS_IOCTL_H 1
| #define HAVE_SYS_MOUNT_H 1
| #define HAVE_SYS_PARAM_H 1
| #define HAVE_SYS_SOCKET_H 1
| #define HAVE_SYS_STATFS_H 1
| #define HAVE_SYS_STATVFS_H 1
| #define HAVE_SYS_TIME_H 1
| #define HAVE_SYS_VFS_H 1
| #define HAVE_SYSLOG_H 1
| #define HAVE_TERMIOS_H 1
| #define HAVE_UNISTD_H 1
| #define HAVE_UTIME_H 1
| #define HAVE_UTMP_H 1
| #define HAVE__BOOL 1
| #define HAVE_STDBOOL_H 1
| #define HAVE_STRUCT_STAT_ST_BLKSIZE 1
| #define HAVE_STRUCT_STAT_ST_BLOCKS 1
| #define HAVE_ST_BLOCKS 1
| #define HAVE_STRUCT_STAT_ST_RDEV 1
| #define TIME_WITH_SYS_TIME 1
| #define HAVE_PTRDIFF_T 1
| #define HAVE_ALLOCA_H 1
| #define HAVE_ALLOCA 1
| #define HAVE_UNISTD_H 1
| #define HAVE_CHOWN 1
| #define HAVE_MBSTATE_T 1
| #define HAVE_UNISTD_H 1
| #define HAVE_FORK 1
| #define HAVE_VFORK 1
| #define HAVE_WORKING_VFORK 1
| #define HAVE_WORKING_FORK 1
| #define GETGROUPS_T gid_t
| #define HAVE_GETGROUPS 1
| /* end confdefs.h. */
|
| /* Override any gcc2 internal prototype to avoid an error. */
| #ifdef __cplusplus
| extern "C"
| #endif
| /* We use char because int might match the return type of a gcc2
| builtin and then its argument prototype would still apply. */
| char getmntent ();
| int
| main ()
| {
| getmntent ();
| ;
| return 0;
| }
configure:8872: result: no
configure:8877: checking for getmntent in -lseq
configure:8907: gcc -o conftest -g -O2 conftest.c -lseq >&5
/usr/bin/ld: cannot find -lseq
collect2: ld returned 1 exit status
configure:8913: $? = 1
configure: failed program was:
| /* confdefs.h. */
|
| #define PACKAGE_NAME "vertex"
| #define PACKAGE_TARNAME "vertex"
| #define PACKAGE_VERSION "0.10"
| #define PACKAGE_STRING "vertex 0.10"
| #define PACKAGE_BUGREPORT "openvertex@googlegroups.com"
| #define PACKAGE "vertex"
| #define VERSION "0.10"
| #ifdef __cplusplus
| extern "C" void std::exit (int) throw (); using std::exit;
| #endif
| #define YYTEXT_POINTER 1
| #define HAVE_DIRENT_H 1
| #define STDC_HEADERS 1
| #define HAVE_SYS_TYPES_H 1
| #define HAVE_SYS_STAT_H 1
| #define HAVE_STDLIB_H 1
| #define HAVE_STRING_H 1
| #define HAVE_MEMORY_H 1
| #define HAVE_STRINGS_H 1
| #define HAVE_INTTYPES_H 1
| #define HAVE_STDINT_H 1
| #define HAVE_UNISTD_H 1
| #define HAVE_SYS_WAIT_H 1
| #define HAVE_ARPA_INET_H 1
| #define HAVE_FCNTL_H 1
| #define HAVE_INTTYPES_H 1
| #define HAVE_LIMITS_H 1
| #define HAVE_LOCALE_H 1
| #define HAVE_MNTENT_H 1
| #define HAVE_NETDB_H 1
| #define HAVE_NETINET_IN_H 1
| #define HAVE_PATHS_H 1
| #define HAVE_SHADOW_H 1
| #define HAVE_STDDEF_H 1
| #define HAVE_STDINT_H 1
| #define HAVE_STDLIB_H 1
| #define HAVE_STRING_H 1
| #define HAVE_STRINGS_H 1
| #define HAVE_SYS_FILE_H 1
| #define HAVE_SYS_IOCTL_H 1
| #define HAVE_SYS_MOUNT_H 1
| #define HAVE_SYS_PARAM_H 1
| #define HAVE_SYS_SOCKET_H 1
| #define HAVE_SYS_STATFS_H 1
| #define HAVE_SYS_STATVFS_H 1
| #define HAVE_SYS_TIME_H 1
| #define HAVE_SYS_VFS_H 1
| #define HAVE_SYSLOG_H 1
| #define HAVE_TERMIOS_H 1
| #define HAVE_UNISTD_H 1
| #define HAVE_UTIME_H 1
| #define HAVE_UTMP_H 1
| #define HAVE__BOOL 1
| #define HAVE_STDBOOL_H 1
| #define HAVE_STRUCT_STAT_ST_BLKSIZE 1
| #define HAVE_STRUCT_STAT_ST_BLOCKS 1
| #define HAVE_ST_BLOCKS 1
| #define HAVE_STRUCT_STAT_ST_RDEV 1
| #define TIME_WITH_SYS_TIME 1
| #define HAVE_PTRDIFF_T 1
| #define HAVE_ALLOCA_H 1
| #define HAVE_ALLOCA 1
| #define HAVE_UNISTD_H 1
| #define HAVE_CHOWN 1
| #define HAVE_MBSTATE_T 1
| #define HAVE_UNISTD_H 1
| #define HAVE_FORK 1
| #define HAVE_VFORK 1
| #define HAVE_WORKING_VFORK 1
| #define HAVE_WORKING_FORK 1
| #define GETGROUPS_T gid_t
| #define HAVE_GETGROUPS 1
| /* end confdefs.h. */
|
| /* Override any gcc2 internal prototype to avoid an error. */
| #ifdef __cplusplus
| extern "C"
| #endif
| /* We use char because int might match the return type of a gcc2
| builtin and then its argument prototype would still apply. */
| char getmntent ();
| int
| main ()
| {
| getmntent ();
| ;
| return 0;
| }
configure:8939: result: no
configure:8944: checking for getmntent in -lgen
configure:8974: gcc -o conftest -g -O2 conftest.c -lgen >&5
/usr/bin/ld: cannot find -lgen
collect2: ld returned 1 exit status
configure:8980: $? = 1
configure: failed program was:
| /* confdefs.h. */
|
| #define PACKAGE_NAME "vertex"
| #define PACKAGE_TARNAME "vertex"
| #define PACKAGE_VERSION "0.10"
| #define PACKAGE_STRING "vertex 0.10"
| #define PACKAGE_BUGREPORT "openvertex@googlegroups.com"
| #define PACKAGE "vertex"
| #define VERSION "0.10"
| #ifdef __cplusplus
| extern "C" void std::exit (int) throw (); using std::exit;
| #endif
| #define YYTEXT_POINTER 1
| #define HAVE_DIRENT_H 1
| #define STDC_HEADERS 1
| #define HAVE_SYS_TYPES_H 1
| #define HAVE_SYS_STAT_H 1
| #define HAVE_STDLIB_H 1
| #define HAVE_STRING_H 1
| #define HAVE_MEMORY_H 1
| #define HAVE_STRINGS_H 1
| #define HAVE_INTTYPES_H 1
| #define HAVE_STDINT_H 1
| #define HAVE_UNISTD_H 1
| #define HAVE_SYS_WAIT_H 1
| #define HAVE_ARPA_INET_H 1
| #define HAVE_FCNTL_H 1
| #define HAVE_INTTYPES_H 1
| #define HAVE_LIMITS_H 1
| #define HAVE_LOCALE_H 1
| #define HAVE_MNTENT_H 1
| #define HAVE_NETDB_H 1
| #define HAVE_NETINET_IN_H 1
| #define HAVE_PATHS_H 1
| #define HAVE_SHADOW_H 1
| #define HAVE_STDDEF_H 1
| #define HAVE_STDINT_H 1
| #define HAVE_STDLIB_H 1
| #define HAVE_STRING_H 1
| #define HAVE_STRINGS_H 1
| #define HAVE_SYS_FILE_H 1
| #define HAVE_SYS_IOCTL_H 1
| #define HAVE_SYS_MOUNT_H 1
| #define HAVE_SYS_PARAM_H 1
| #define HAVE_SYS_SOCKET_H 1
| #define HAVE_SYS_STATFS_H 1
| #define HAVE_SYS_STATVFS_H 1
| #define HAVE_SYS_TIME_H 1
| #define HAVE_SYS_VFS_H 1
| #define HAVE_SYSLOG_H 1
| #define HAVE_TERMIOS_H 1
| #define HAVE_UNISTD_H 1
| #define HAVE_UTIME_H 1
| #define HAVE_UTMP_H 1
| #define HAVE__BOOL 1
| #define HAVE_STDBOOL_H 1
| #define HAVE_STRUCT_STAT_ST_BLKSIZE 1
| #define HAVE_STRUCT_STAT_ST_BLOCKS 1
| #define HAVE_ST_BLOCKS 1
| #define HAVE_STRUCT_STAT_ST_RDEV 1
| #define TIME_WITH_SYS_TIME 1
| #define HAVE_PTRDIFF_T 1
| #define HAVE_ALLOCA_H 1
| #define HAVE_ALLOCA 1
| #define HAVE_UNISTD_H 1
| #define HAVE_CHOWN 1
| #define HAVE_MBSTATE_T 1
| #define HAVE_UNISTD_H 1
| #define HAVE_FORK 1
| #define HAVE_VFORK 1
| #define HAVE_WORKING_VFORK 1
| #define HAVE_WORKING_FORK 1
| #define GETGROUPS_T gid_t
| #define HAVE_GETGROUPS 1
| /* end confdefs.h. */
|
| /* Override any gcc2 internal prototype to avoid an error. */
| #ifdef __cplusplus
| extern "C"
| #endif
| /* We use char because int might match the return type of a gcc2
| builtin and then its argument prototype would still apply. */
| char getmntent ();
| int
| main ()
| {
| getmntent ();
| ;
| return 0;
| }
configure:9006: result: no
configure:9020: checking for getmntent
configure:9077: gcc -o conftest -g -O2 conftest.c >&5
configure:9083: $? = 0
configure:9087: test -z
|| test ! -s conftest.err
configure:9090: $? = 0
configure:9093: test -s conftest
configure:9096: $? = 0
configure:9108: result: yes
configure:9119: checking whether getpgrp requires zero arguments
configure:9141: gcc -c -g -O2 conftest.c >&5
conftest.c: In function 'main':
conftest.c:114: error: too many arguments to function 'getpgrp'
configure:9147: $? = 1
configure: failed program was:
| /* confdefs.h. */
|
| #define PACKAGE_NAME "vertex"
| #define PACKAGE_TARNAME "vertex"
| #define PACKAGE_VERSION "0.10"
| #define PACKAGE_STRING "vertex 0.10"
| #define PACKAGE_BUGREPORT "openvertex@googlegroups.com"
| #define PACKAGE "vertex"
| #define VERSION "0.10"
| #ifdef __cplusplus
| extern "C" void std::exit (int) throw (); using std::exit;
| #endif
| #define YYTEXT_POINTER 1
| #define HAVE_DIRENT_H 1
| #define STDC_HEADERS 1
| #define HAVE_SYS_TYPES_H 1
| #define HAVE_SYS_STAT_H 1
| #define HAVE_STDLIB_H 1
| #define HAVE_STRING_H 1
| #define HAVE_MEMORY_H 1
| #define HAVE_STRINGS_H 1
| #define HAVE_INTTYPES_H 1
| #define HAVE_STDINT_H 1
| #define HAVE_UNISTD_H 1
| #define HAVE_SYS_WAIT_H 1
| #define HAVE_ARPA_INET_H 1
| #define HAVE_FCNTL_H 1
| #define HAVE_INTTYPES_H 1
| #define HAVE_LIMITS_H 1
| #define HAVE_LOCALE_H 1
| #define HAVE_MNTENT_H 1
| #define HAVE_NETDB_H 1
| #define HAVE_NETINET_IN_H 1
| #define HAVE_PATHS_H 1
| #define HAVE_SHADOW_H 1
| #define HAVE_STDDEF_H 1
| #define HAVE_STDINT_H 1
| #define HAVE_STDLIB_H 1
| #define HAVE_STRING_H 1
| #define HAVE_STRINGS_H 1
| #define HAVE_SYS_FILE_H 1
| #define HAVE_SYS_IOCTL_H 1
| #define HAVE_SYS_MOUNT_H 1
| #define HAVE_SYS_PARAM_H 1
| #define HAVE_SYS_SOCKET_H 1
| #define HAVE_SYS_STATFS_H 1
| #define HAVE_SYS_STATVFS_H 1
| #define HAVE_SYS_TIME_H 1
| #define HAVE_SYS_VFS_H 1
| #define HAVE_SYSLOG_H 1
| #define HAVE_TERMIOS_H 1
| #define HAVE_UNISTD_H 1
| #define HAVE_UTIME_H 1
| #define HAVE_UTMP_H 1
| #define HAVE__BOOL 1
| #define HAVE_STDBOOL_H 1
| #define HAVE_STRUCT_STAT_ST_BLKSIZE 1
| #define HAVE_STRUCT_STAT_ST_BLOCKS 1
| #define HAVE_ST_BLOCKS 1
| #define HAVE_STRUCT_STAT_ST_RDEV 1
| #define TIME_WITH_SYS_TIME 1
| #define HAVE_PTRDIFF_T 1
| #define HAVE_ALLOCA_H 1
| #define HAVE_ALLOCA 1
| #define HAVE_UNISTD_H 1
| #define HAVE_CHOWN 1
| #define HAVE_MBSTATE_T 1
| #define HAVE_UNISTD_H 1
| #define HAVE_FORK 1
| #define HAVE_VFORK 1
| #define HAVE_WORKING_VFORK 1
| #define HAVE_WORKING_FORK 1
| #define GETGROUPS_T gid_t
| #define HAVE_GETGROUPS 1
| #define HAVE_GETMNTENT 1
| /* end confdefs.h. */
| #include <stdio.h>
| #if HAVE_SYS_TYPES_H
| # include <sys/types.h>
| #endif
| #if HAVE_SYS_STAT_H
| # include <sys/stat.h>
| #endif
| #if STDC_HEADERS
| # include <stdlib.h>
| # include <stddef.h>
| #else
| # if HAVE_STDLIB_H
| # include <stdlib.h>
| # endif
| #endif
| #if HAVE_STRING_H
| # if !STDC_HEADERS && HAVE_MEMORY_H
| # include <memory.h>
| # endif
| # include <string.h>
| #endif
| #if HAVE_STRINGS_H
| # include <strings.h>
| #endif
| #if HAVE_INTTYPES_H
| # include <inttypes.h>
| #else
| # if HAVE_STDINT_H
| # include <stdint.h>
| # endif
| #endif
| #if HAVE_UNISTD_H
| # include <unistd.h>
| #endif
| int
| main ()
| {
| getpgrp (0);
| ;
| return 0;
| }
configure:9172: result: yes
configure:9183: checking whether gcc needs -traditional
configure:9225: result: no
configure:9232: checking whether lstat dereferences a symlink specified with a trailing slash
configure:9263: gcc -o conftest -g -O2 conftest.c >&5
configure:9266: $? = 0
configure:9268: ./conftest
configure:9271: $? = 0
configure:9292: result: yes
configure:9313: checking whether lstat accepts an empty string
configure:9338: gcc -o conftest -g -O2 conftest.c >&5
configure:9341: $? = 0
configure:9343: ./conftest
configure:9346: $? = 1
configure: program exited with status 1
configure: failed program was:
| /* confdefs.h. */
|
| #define PACKAGE_NAME "vertex"
| #define PACKAGE_TARNAME "vertex"
| #define PACKAGE_VERSION "0.10"
| #define PACKAGE_STRING "vertex 0.10"
| #define PACKAGE_BUGREPORT "openvertex@googlegroups.com"
| #define PACKAGE "vertex"
| #define VERSION "0.10"
| #ifdef __cplusplus
| extern "C" void std::exit (int) throw (); using std::exit;
| #endif
| #define YYTEXT_POINTER 1
| #define HAVE_DIRENT_H 1
| #define STDC_HEADERS 1
| #define HAVE_SYS_TYPES_H 1
| #define HAVE_SYS_STAT_H 1
| #define HAVE_STDLIB_H 1
| #define HAVE_STRING_H 1
| #define HAVE_MEMORY_H 1
| #define HAVE_STRINGS_H 1
| #define HAVE_INTTYPES_H 1
| #define HAVE_STDINT_H 1
| #define HAVE_UNISTD_H 1
| #define HAVE_SYS_WAIT_H 1
| #define HAVE_ARPA_INET_H 1
| #define HAVE_FCNTL_H 1
| #define HAVE_INTTYPES_H 1
| #define HAVE_LIMITS_H 1
| #define HAVE_LOCALE_H 1
| #define HAVE_MNTENT_H 1
| #define HAVE_NETDB_H 1
| #define HAVE_NETINET_IN_H 1
| #define HAVE_PATHS_H 1
| #define HAVE_SHADOW_H 1
| #define HAVE_STDDEF_H 1
| #define HAVE_STDINT_H 1
| #define HAVE_STDLIB_H 1
| #define HAVE_STRING_H 1
| #define HAVE_STRINGS_H 1
| #define HAVE_SYS_FILE_H 1
| #define HAVE_SYS_IOCTL_H 1
| #define HAVE_SYS_MOUNT_H 1
| #define HAVE_SYS_PARAM_H 1
| #define HAVE_SYS_SOCKET_H 1
| #define HAVE_SYS_STATFS_H 1
| #define HAVE_SYS_STATVFS_H 1
| #define HAVE_SYS_TIME_H 1
| #define HAVE_SYS_VFS_H 1
| #define HAVE_SYSLOG_H 1
| #define HAVE_TERMIOS_H 1
| #define HAVE_UNISTD_H 1
| #define HAVE_UTIME_H 1
| #define HAVE_UTMP_H 1
| #define HAVE__BOOL 1
| #define HAVE_STDBOOL_H 1
| #define HAVE_STRUCT_STAT_ST_BLKSIZE 1
| #define HAVE_STRUCT_STAT_ST_BLOCKS 1
| #define HAVE_ST_BLOCKS 1
| #define HAVE_STRUCT_STAT_ST_RDEV 1
| #define TIME_WITH_SYS_TIME 1
| #define HAVE_PTRDIFF_T 1
| #define HAVE_ALLOCA_H 1
| #define HAVE_ALLOCA 1
| #define HAVE_UNISTD_H 1
| #define HAVE_CHOWN 1
| #define HAVE_MBSTATE_T 1
| #define HAVE_UNISTD_H 1
| #define HAVE_FORK 1
| #define HAVE_VFORK 1
| #define HAVE_WORKING_VFORK 1
| #define HAVE_WORKING_FORK 1
| #define GETGROUPS_T gid_t
| #define HAVE_GETGROUPS 1
| #define HAVE_GETMNTENT 1
| #define GETPGRP_VOID 1
| #define LSTAT_FOLLOWS_SLASHED_SYMLINK 1
| /* end confdefs.h. */
| #include <stdio.h>
| #if HAVE_SYS_TYPES_H
| # include <sys/types.h>
| #endif
| #if HAVE_SYS_STAT_H
| # include <sys/stat.h>
| #endif
| #if STDC_HEADERS
| # include <stdlib.h>
| # include <stddef.h>
| #else
| # if HAVE_STDLIB_H
| # include <stdlib.h>
| # endif
| #endif
| #if HAVE_STRING_H
| # if !STDC_HEADERS && HAVE_MEMORY_H
| # include <memory.h>
| # endif
| # include <string.h>
| #endif
| #if HAVE_STRINGS_H
| # include <strings.h>
| #endif
| #if HAVE_INTTYPES_H
| # include <inttypes.h>
| #else
| # if HAVE_STDINT_H
| # include <stdint.h>
| # endif
| #endif
| #if HAVE_UNISTD_H
| # include <unistd.h>
| #endif
| int
| main ()
| {
| struct stat sbuf;
| exit (lstat ("", &sbuf) ? 1 : 0);
| ;
| return 0;
| }
configure:9360: result: no
configure:9378: checking whether lstat dereferences a symlink specified with a trailing slash
configure:9438: result: yes
configure:9464: checking for stdlib.h
configure:9469: result: yes
configure:9609: checking for GNU libc compatible malloc
configure:9638: gcc -o conftest -g -O2 conftest.c >&5
configure:9641: $? = 0
configure:9643: ./conftest
configure:9646: $? = 0
configure:9660: result: yes
configure:9690: checking for working memcmp
configure:9738: gcc -o conftest -g -O2 conftest.c >&5
configure:9741: $? = 0
configure:9743: ./conftest
configure:9746: $? = 0
configure:9760: result: yes
configure:9778: checking for stdlib.h
configure:9783: result: yes
configure:9778: checking for sys/time.h
configure:9783: result: yes
configure:9778: checking for unistd.h
configure:9783: result: yes
configure:9927: checking for alarm
configure:9984: gcc -o conftest -g -O2 conftest.c >&5
configure:9990: $? = 0
configure:9994: test -z
|| test ! -s conftest.err
configure:9997: $? = 0
configure:10000: test -s conftest
configure:10003: $? = 0
configure:10015: result: yes
configure:10025: checking for working mktime
configure:10201: gcc -o conftest -g -O2 conftest.c >&5
configure:10204: $? = 0
configure:10206: ./conftest
configure:10209: $? = 0
configure:10223: result: yes
configure:10242: checking for stdlib.h
configure:10247: result: yes
configure:10242: checking for unistd.h
configure:10247: result: yes
configure:10391: checking for getpagesize
configure:10448: gcc -o conftest -g -O2 conftest.c >&5
configure:10454: $? = 0
configure:10458: test -z
|| test ! -s conftest.err
configure:10461: $? = 0
configure:10464: test -s conftest
configure:10467: $? = 0
configure:10479: result: yes
configure:10489: checking for working mmap
configure:10631: gcc -o conftest -g -O2 conftest.c >&5
configure:10634: $? = 0
configure:10636: ./conftest
configure:10639: $? = 0
configure:10653: result: yes
configure:10669: checking for stdlib.h
configure:10674: result: yes
configure:10814: checking for GNU libc compatible realloc
configure:10843: gcc -o conftest -g -O2 conftest.c >&5
configure:10846: $? = 0
configure:10848: ./conftest
configure:10851: $? = 0
configure:10865: result: yes
configure:10910: checking sys/select.h usability
configure:10922: gcc -c -g -O2 conftest.c >&5
configure:10928: $? = 0
configure:10932: test -z
|| test ! -s conftest.err
configure:10935: $? = 0
configure:10938: test -s conftest.o
configure:10941: $? = 0
configure:10951: result: yes
configure:10955: checking sys/select.h presence
configure:10965: gcc -E conftest.c
configure:10971: $? = 0
configure:10991: result: yes
configure:11026: checking for sys/select.h
configure:11033: result: yes
configure:10901: checking for sys/socket.h
configure:10906: result: yes
configure:11046: checking types of arguments for select
configure:11079: gcc -c -g -O2 conftest.c >&5
configure:11085: $? = 0
configure:11089: test -z
|| test ! -s conftest.err
configure:11092: $? = 0
configure:11095: test -s conftest.o
configure:11098: $? = 0
configure:11114: result: int,fd_set *,struct timeval *
configure:11137: checking for function prototypes
configure:11140: result: yes
configure:11157: checking whether setvbuf arguments are reversed
configure:11182: gcc -o conftest -g -O2 conftest.c >&5
conftest.c:101: error: conflicting types for 'setvbuf'
/usr/include/stdio.h:308: error: previous declaration of 'setvbuf' was here
configure:11188: $? = 1
configure: failed program was:
| /* confdefs.h. */
|
| #define PACKAGE_NAME "vertex"
| #define PACKAGE_TARNAME "vertex"
| #define PACKAGE_VERSION "0.10"
| #define PACKAGE_STRING "vertex 0.10"
| #define PACKAGE_BUGREPORT "openvertex@googlegroups.com"
| #define PACKAGE "vertex"
| #define VERSION "0.10"
| #ifdef __cplusplus
| extern "C" void std::exit (int) throw (); using std::exit;
| #endif
| #define YYTEXT_POINTER 1
| #define HAVE_DIRENT_H 1
| #define STDC_HEADERS 1
| #define HAVE_SYS_TYPES_H 1
| #define HAVE_SYS_STAT_H 1
| #define HAVE_STDLIB_H 1
| #define HAVE_STRING_H 1
| #define HAVE_MEMORY_H 1
| #define HAVE_STRINGS_H 1
| #define HAVE_INTTYPES_H 1
| #define HAVE_STDINT_H 1
| #define HAVE_UNISTD_H 1
| #define HAVE_SYS_WAIT_H 1
| #define HAVE_ARPA_INET_H 1
| #define HAVE_FCNTL_H 1
| #define HAVE_INTTYPES_H 1
| #define HAVE_LIMITS_H 1
| #define HAVE_LOCALE_H 1
| #define HAVE_MNTENT_H 1
| #define HAVE_NETDB_H 1
| #define HAVE_NETINET_IN_H 1
| #define HAVE_PATHS_H 1
| #define HAVE_SHADOW_H 1
| #define HAVE_STDDEF_H 1
| #define HAVE_STDINT_H 1
| #define HAVE_STDLIB_H 1
| #define HAVE_STRING_H 1
| #define HAVE_STRINGS_H 1
| #define HAVE_SYS_FILE_H 1
| #define HAVE_SYS_IOCTL_H 1
| #define HAVE_SYS_MOUNT_H 1
| #define HAVE_SYS_PARAM_H 1
| #define HAVE_SYS_SOCKET_H 1
| #define HAVE_SYS_STATFS_H 1
| #define HAVE_SYS_STATVFS_H 1
| #define HAVE_SYS_TIME_H 1
| #define HAVE_SYS_VFS_H 1
| #define HAVE_SYSLOG_H 1
| #define HAVE_TERMIOS_H 1
| #define HAVE_UNISTD_H 1
| #define HAVE_UTIME_H 1
| #define HAVE_UTMP_H 1
| #define HAVE__BOOL 1
| #define HAVE_STDBOOL_H 1
| #define HAVE_STRUCT_STAT_ST_BLKSIZE 1
| #define HAVE_STRUCT_STAT_ST_BLOCKS 1
| #define HAVE_ST_BLOCKS 1
| #define HAVE_STRUCT_STAT_ST_RDEV 1
| #define TIME_WITH_SYS_TIME 1
| #define HAVE_PTRDIFF_T 1
| #define HAVE_ALLOCA_H 1
| #define HAVE_ALLOCA 1
| #define HAVE_UNISTD_H 1
| #define HAVE_CHOWN 1
| #define HAVE_MBSTATE_T 1
| #define HAVE_UNISTD_H 1
| #define HAVE_FORK 1
| #define HAVE_VFORK 1
| #define HAVE_WORKING_VFORK 1
| #define HAVE_WORKING_FORK 1
| #define GETGROUPS_T gid_t
| #define HAVE_GETGROUPS 1
| #define HAVE_GETMNTENT 1
| #define GETPGRP_VOID 1
| #define LSTAT_FOLLOWS_SLASHED_SYMLINK 1
| #define LSTAT_FOLLOWS_SLASHED_SYMLINK 1
| #define HAVE_STDLIB_H 1
| #define HAVE_MALLOC 1
| #define HAVE_STDLIB_H 1
| #define HAVE_SYS_TIME_H 1
| #define HAVE_UNISTD_H 1
| #define HAVE_ALARM 1
| #define HAVE_STDLIB_H 1
| #define HAVE_UNISTD_H 1
| #define HAVE_GETPAGESIZE 1
| #define HAVE_MMAP 1
| #define HAVE_STDLIB_H 1
| #define HAVE_REALLOC 1
| #define HAVE_SYS_SELECT_H 1
| #define HAVE_SYS_SOCKET_H 1
| #define SELECT_TYPE_ARG1 int
| #define SELECT_TYPE_ARG234 (fd_set *)
| #define SELECT_TYPE_ARG5 (struct timeval *)
| #define PROTOTYPES 1
| #define __PROTOTYPES 1
| /* end confdefs.h. */
| #include <stdio.h>
| # if PROTOTYPES
| int (setvbuf) (FILE *, int, char *, size_t);
| # endif
| int
| main ()
| {
| char buf; return setvbuf (stdout, _IOLBF, &buf, 1);
| ;
| return 0;
| }
configure:11309: result: no
configure:11320: checking whether stat accepts an empty string
configure:11345: gcc -o conftest -g -O2 conftest.c >&5
configure:11348: $? = 0
configure:11350: ./conftest
configure:11353: $? = 1
configure: program exited with status 1
configure: failed program was:
| /* confdefs.h. */
|
| #define PACKAGE_NAME "vertex"
| #define PACKAGE_TARNAME "vertex"
| #define PACKAGE_VERSION "0.10"
| #define PACKAGE_STRING "vertex 0.10"
| #define PACKAGE_BUGREPORT "openvertex@googlegroups.com"
| #define PACKAGE "vertex"
| #define VERSION "0.10"
| #ifdef __cplusplus
| extern "C" void std::exit (int) throw (); using std::exit;
| #endif
| #define YYTEXT_POINTER 1
| #define HAVE_DIRENT_H 1
| #define STDC_HEADERS 1
| #define HAVE_SYS_TYPES_H 1
| #define HAVE_SYS_STAT_H 1
| #define HAVE_STDLIB_H 1
| #define HAVE_STRING_H 1
| #define HAVE_MEMORY_H 1
| #define HAVE_STRINGS_H 1
| #define HAVE_INTTYPES_H 1
| #define HAVE_STDINT_H 1
| #define HAVE_UNISTD_H 1
| #define HAVE_SYS_WAIT_H 1
| #define HAVE_ARPA_INET_H 1
| #define HAVE_FCNTL_H 1
| #define HAVE_INTTYPES_H 1
| #define HAVE_LIMITS_H 1
| #define HAVE_LOCALE_H 1
| #define HAVE_MNTENT_H 1
| #define HAVE_NETDB_H 1
| #define HAVE_NETINET_IN_H 1
| #define HAVE_PATHS_H 1
| #define HAVE_SHADOW_H 1
| #define HAVE_STDDEF_H 1
| #define HAVE_STDINT_H 1
| #define HAVE_STDLIB_H 1
| #define HAVE_STRING_H 1
| #define HAVE_STRINGS_H 1
| #define HAVE_SYS_FILE_H 1
| #define HAVE_SYS_IOCTL_H 1
| #define HAVE_SYS_MOUNT_H 1
| #define HAVE_SYS_PARAM_H 1
| #define HAVE_SYS_SOCKET_H 1
| #define HAVE_SYS_STATFS_H 1
| #define HAVE_SYS_STATVFS_H 1
| #define HAVE_SYS_TIME_H 1
| #define HAVE_SYS_VFS_H 1
| #define HAVE_SYSLOG_H 1
| #define HAVE_TERMIOS_H 1
| #define HAVE_UNISTD_H 1
| #define HAVE_UTIME_H 1
| #define HAVE_UTMP_H 1
| #define HAVE__BOOL 1
| #define HAVE_STDBOOL_H 1
| #define HAVE_STRUCT_STAT_ST_BLKSIZE 1
| #define HAVE_STRUCT_STAT_ST_BLOCKS 1
| #define HAVE_ST_BLOCKS 1
| #define HAVE_STRUCT_STAT_ST_RDEV 1
| #define TIME_WITH_SYS_TIME 1
| #define HAVE_PTRDIFF_T 1
| #define HAVE_ALLOCA_H 1
| #define HAVE_ALLOCA 1
| #define HAVE_UNISTD_H 1
| #define HAVE_CHOWN 1
| #define HAVE_MBSTATE_T 1
| #define HAVE_UNISTD_H 1
| #define HAVE_FORK 1
| #define HAVE_VFORK 1
| #define HAVE_WORKING_VFORK 1
| #define HAVE_WORKING_FORK 1
| #define GETGROUPS_T gid_t
| #define HAVE_GETGROUPS 1
| #define HAVE_GETMNTENT 1
| #define GETPGRP_VOID 1
| #define LSTAT_FOLLOWS_SLASHED_SYMLINK 1
| #define LSTAT_FOLLOWS_SLASHED_SYMLINK 1
| #define HAVE_STDLIB_H 1
| #define HAVE_MALLOC 1
| #define HAVE_STDLIB_H 1
| #define HAVE_SYS_TIME_H 1
| #define HAVE_UNISTD_H 1
| #define HAVE_ALARM 1
| #define HAVE_STDLIB_H 1
| #define HAVE_UNISTD_H 1
| #define HAVE_GETPAGESIZE 1
| #define HAVE_MMAP 1
| #define HAVE_STDLIB_H 1
| #define HAVE_REALLOC 1
| #define HAVE_SYS_SELECT_H 1
| #define HAVE_SYS_SOCKET_H 1
| #define SELECT_TYPE_ARG1 int
| #define SELECT_TYPE_ARG234 (fd_set *)
| #define SELECT_TYPE_ARG5 (struct timeval *)
| #define PROTOTYPES 1
| #define __PROTOTYPES 1
| /* end confdefs.h. */
| #include <stdio.h>
| #if HAVE_SYS_TYPES_H
| # include <sys/types.h>
| #endif
| #if HAVE_SYS_STAT_H
| # include <sys/stat.h>
| #endif
| #if STDC_HEADERS
| # include <stdlib.h>
| # include <stddef.h>
| #else
| # if HAVE_STDLIB_H
| # include <stdlib.h>
| # endif
| #endif
| #if HAVE_STRING_H
| # if !STDC_HEADERS && HAVE_MEMORY_H
| # include <memory.h>
| # endif
| # include <string.h>
| #endif
| #if HAVE_STRINGS_H
| # include <strings.h>
| #endif
| #if HAVE_INTTYPES_H
| # include <inttypes.h>
| #else
| # if HAVE_STDINT_H
| # include <stdint.h>
| # endif
| #endif
| #if HAVE_UNISTD_H
| # include <unistd.h>
| #endif
| int
| main ()
| {
| struct stat sbuf;
| exit (stat ("", &sbuf) ? 1 : 0);
| ;
| return 0;
| }
configure:11367: result: no
configure:11385: checking for working strcoll
configure:11411: gcc -o conftest -g -O2 conftest.c >&5
configure:11414: $? = 0
configure:11416: ./conftest
configure:11419: $? = 0
configure:11433: result: yes
configure:11443: checking whether strerror_r is declared
configure:11467: gcc -c -g -O2 conftest.c >&5
configure:11473: $? = 0
configure:11477: test -z
|| test ! -s conftest.err
configure:11480: $? = 0
configure:11483: test -s conftest.o
configure:11486: $? = 0
configure:11497: result: yes
configure:11519: checking for strerror_r
configure:11576: gcc -o conftest -g -O2 conftest.c >&5
configure:11582: $? = 0
configure:11586: test -z
|| test ! -s conftest.err
configure:11589: $? = 0
configure:11592: test -s conftest
configure:11595: $? = 0
configure:11607: result: yes
configure:11617: checking whether strerror_r returns char *
configure:11645: gcc -c -g -O2 conftest.c >&5
conftest.c: In function 'main':
conftest.c:141: error: invalid type argument of 'unary *'
conftest.c:142: warning: initialization makes pointer from integer without a cast
configure:11651: $? = 1
configure: failed program was:
| /* confdefs.h. */
|
| #define PACKAGE_NAME "vertex"
| #define PACKAGE_TARNAME "vertex"
| #define PACKAGE_VERSION "0.10"
| #define PACKAGE_STRING "vertex 0.10"
| #define PACKAGE_BUGREPORT "openvertex@googlegroups.com"
| #define PACKAGE "vertex"
| #define VERSION "0.10"
| #ifdef __cplusplus
| extern "C" void std::exit (int) throw (); using std::exit;
| #endif
| #define YYTEXT_POINTER 1
| #define HAVE_DIRENT_H 1
| #define STDC_HEADERS 1
| #define HAVE_SYS_TYPES_H 1
| #define HAVE_SYS_STAT_H 1
| #define HAVE_STDLIB_H 1
| #define HAVE_STRING_H 1
| #define HAVE_MEMORY_H 1
| #define HAVE_STRINGS_H 1
| #define HAVE_INTTYPES_H 1
| #define HAVE_STDINT_H 1
| #define HAVE_UNISTD_H 1
| #define HAVE_SYS_WAIT_H 1
| #define HAVE_ARPA_INET_H 1
| #define HAVE_FCNTL_H 1
| #define HAVE_INTTYPES_H 1
| #define HAVE_LIMITS_H 1
| #define HAVE_LOCALE_H 1
| #define HAVE_MNTENT_H 1
| #define HAVE_NETDB_H 1
| #define HAVE_NETINET_IN_H 1
| #define HAVE_PATHS_H 1
| #define HAVE_SHADOW_H 1
| #define HAVE_STDDEF_H 1
| #define HAVE_STDINT_H 1
| #define HAVE_STDLIB_H 1
| #define HAVE_STRING_H 1
| #define HAVE_STRINGS_H 1
| #define HAVE_SYS_FILE_H 1
| #define HAVE_SYS_IOCTL_H 1
| #define HAVE_SYS_MOUNT_H 1
| #define HAVE_SYS_PARAM_H 1
| #define HAVE_SYS_SOCKET_H 1
| #define HAVE_SYS_STATFS_H 1
| #define HAVE_SYS_STATVFS_H 1
| #define HAVE_SYS_TIME_H 1
| #define HAVE_SYS_VFS_H 1
| #define HAVE_SYSLOG_H 1
| #define HAVE_TERMIOS_H 1
| #define HAVE_UNISTD_H 1
| #define HAVE_UTIME_H 1
| #define HAVE_UTMP_H 1
| #define HAVE__BOOL 1
| #define HAVE_STDBOOL_H 1
| #define HAVE_STRUCT_STAT_ST_BLKSIZE 1
| #define HAVE_STRUCT_STAT_ST_BLOCKS 1
| #define HAVE_ST_BLOCKS 1
| #define HAVE_STRUCT_STAT_ST_RDEV 1
| #define TIME_WITH_SYS_TIME 1
| #define HAVE_PTRDIFF_T 1
| #define HAVE_ALLOCA_H 1
| #define HAVE_ALLOCA 1
| #define HAVE_UNISTD_H 1
| #define HAVE_CHOWN 1
| #define HAVE_MBSTATE_T 1
| #define HAVE_UNISTD_H 1
| #define HAVE_FORK 1
| #define HAVE_VFORK 1
| #define HAVE_WORKING_VFORK 1
| #define HAVE_WORKING_FORK 1
| #define GETGROUPS_T gid_t
| #define HAVE_GETGROUPS 1
| #define HAVE_GETMNTENT 1
| #define GETPGRP_VOID 1
| #define LSTAT_FOLLOWS_SLASHED_SYMLINK 1
| #define LSTAT_FOLLOWS_SLASHED_SYMLINK 1
| #define HAVE_STDLIB_H 1
| #define HAVE_MALLOC 1
| #define HAVE_STDLIB_H 1
| #define HAVE_SYS_TIME_H 1
| #define HAVE_UNISTD_H 1
| #define HAVE_ALARM 1
| #define HAVE_STDLIB_H 1
| #define HAVE_UNISTD_H 1
| #define HAVE_GETPAGESIZE 1
| #define HAVE_MMAP 1
| #define HAVE_STDLIB_H 1
| #define HAVE_REALLOC 1
| #define HAVE_SYS_SELECT_H 1
| #define HAVE_SYS_SOCKET_H 1
| #define SELECT_TYPE_ARG1 int
| #define SELECT_TYPE_ARG234 (fd_set *)
| #define SELECT_TYPE_ARG5 (struct timeval *)
| #define PROTOTYPES 1
| #define __PROTOTYPES 1
| #define HAVE_STRCOLL 1
| #define HAVE_DECL_STRERROR_R 1
| #define HAVE_STRERROR_R 1
| /* end confdefs.h. */
| #include <stdio.h>
| #if HAVE_SYS_TYPES_H
| # include <sys/types.h>
| #endif
| #if HAVE_SYS_STAT_H
| # include <sys/stat.h>
| #endif
| #if STDC_HEADERS
| # include <stdlib.h>
| # include <stddef.h>
| #else
| # if HAVE_STDLIB_H
| # include <stdlib.h>
| # endif
| #endif
| #if HAVE_STRING_H
| # if !STDC_HEADERS && HAVE_MEMORY_H
| # include <memory.h>
| # endif
| # include <string.h>
| #endif
| #if HAVE_STRINGS_H
| # include <strings.h>
| #endif
| #if HAVE_INTTYPES_H
| # include <inttypes.h>
| #else
| # if HAVE_STDINT_H
| # include <stdint.h>
| # endif
| #endif
| #if HAVE_UNISTD_H
| # include <unistd.h>
| #endif
| int
| main ()
| {
|
| char buf[100];
| char x = *strerror_r (0, buf, sizeof buf);
| char *p = strerror_r (0, buf, sizeof buf);
|
| ;
| return 0;
| }
configure:11724: result: no
configure:11738: checking for strftime
configure:11795: gcc -o conftest -g -O2 conftest.c >&5
conftest.c:126: warning: conflicting types for built-in function 'strftime'
configure:11801: $? = 0
configure:11805: test -z
|| test ! -s conftest.err
configure:11808: $? = 0
configure:11811: test -s conftest
configure:11814: $? = 0
configure:11826: result: yes
configure:11910: checking for working strnlen
configure:11949: gcc -o conftest -g -O2 conftest.c >&5
configure:11952: $? = 0
configure:11954: ./conftest
configure:11957: $? = 0
configure:11971: result: yes
configure:11982: checking for working strtod
configure:12025: gcc -o conftest -g -O2 conftest.c >&5
conftest.c: In function 'main':
conftest.c:115: warning: incompatible implicit declaration of built-in function 'exit'
conftest.c:125: warning: incompatible implicit declaration of built-in function 'exit'
conftest.c:127: warning: incompatible implicit declaration of built-in function 'exit'
configure:12028: $? = 0
configure:12030: ./conftest
configure:12033: $? = 0
configure:12047: result: yes
configure:12225: checking whether utime accepts a null argument
configure:12256: gcc -o conftest -g -O2 conftest.c >&5
configure:12259: $? = 0
configure:12261: ./conftest
configure:12264: $? = 0
configure:12279: result: yes
configure:12294: checking for vprintf
configure:12351: gcc -o conftest -g -O2 conftest.c >&5
conftest.c:128: warning: conflicting types for built-in function 'vprintf'
configure:12357: $? = 0
configure:12361: test -z
|| test ! -s conftest.err
configure:12364: $? = 0
configure:12367: test -s conftest
configure:12370: $? = 0
configure:12382: result: yes
configure:12389: checking for _doprnt
configure:12446: gcc -o conftest -g -O2 conftest.c >&5
/tmp/ccGTCg1d.o: In function `main':
/home/amjad/svn/vertex/conftest.c:144: undefined reference to `_doprnt'
/tmp/ccGTCg1d.o:(.data+0x0): undefined reference to `_doprnt'
collect2: ld returned 1 exit status
configure:12452: $? = 1
configure: failed program was:
| /* confdefs.h. */
|
| #define PACKAGE_NAME "vertex"
| #define PACKAGE_TARNAME "vertex"
| #define PACKAGE_VERSION "0.10"
| #define PACKAGE_STRING "vertex 0.10"
| #define PACKAGE_BUGREPORT "openvertex@googlegroups.com"
| #define PACKAGE "vertex"
| #define VERSION "0.10"
| #ifdef __cplusplus
| extern "C" void std::exit (int) throw (); using std::exit;
| #endif
| #define YYTEXT_POINTER 1
| #define HAVE_DIRENT_H 1
| #define STDC_HEADERS 1
| #define HAVE_SYS_TYPES_H 1
| #define HAVE_SYS_STAT_H 1
| #define HAVE_STDLIB_H 1
| #define HAVE_STRING_H 1
| #define HAVE_MEMORY_H 1
| #define HAVE_STRINGS_H 1
| #define HAVE_INTTYPES_H 1
| #define HAVE_STDINT_H 1
| #define HAVE_UNISTD_H 1
| #define HAVE_SYS_WAIT_H 1
| #define HAVE_ARPA_INET_H 1
| #define HAVE_FCNTL_H 1
| #define HAVE_INTTYPES_H 1
| #define HAVE_LIMITS_H 1
| #define HAVE_LOCALE_H 1
| #define HAVE_MNTENT_H 1
| #define HAVE_NETDB_H 1
| #define HAVE_NETINET_IN_H 1
| #define HAVE_PATHS_H 1
| #define HAVE_SHADOW_H 1
| #define HAVE_STDDEF_H 1
| #define HAVE_STDINT_H 1
| #define HAVE_STDLIB_H 1
| #define HAVE_STRING_H 1
| #define HAVE_STRINGS_H 1
| #define HAVE_SYS_FILE_H 1
| #define HAVE_SYS_IOCTL_H 1
| #define HAVE_SYS_MOUNT_H 1
| #define HAVE_SYS_PARAM_H 1
| #define HAVE_SYS_SOCKET_H 1
| #define HAVE_SYS_STATFS_H 1
| #define HAVE_SYS_STATVFS_H 1
| #define HAVE_SYS_TIME_H 1
| #define HAVE_SYS_VFS_H 1
| #define HAVE_SYSLOG_H 1
| #define HAVE_TERMIOS_H 1
| #define HAVE_UNISTD_H 1
| #define HAVE_UTIME_H 1
| #define HAVE_UTMP_H 1
| #define HAVE__BOOL 1
| #define HAVE_STDBOOL_H 1
| #define HAVE_STRUCT_STAT_ST_BLKSIZE 1
| #define HAVE_STRUCT_STAT_ST_BLOCKS 1
| #define HAVE_ST_BLOCKS 1
| #define HAVE_STRUCT_STAT_ST_RDEV 1
| #define TIME_WITH_SYS_TIME 1
| #define HAVE_PTRDIFF_T 1
| #define HAVE_ALLOCA_H 1
| #define HAVE_ALLOCA 1
| #define HAVE_UNISTD_H 1
| #define HAVE_CHOWN 1
| #define HAVE_MBSTATE_T 1
| #define HAVE_UNISTD_H 1
| #define HAVE_FORK 1
| #define HAVE_VFORK 1
| #define HAVE_WORKING_VFORK 1
| #define HAVE_WORKING_FORK 1
| #define GETGROUPS_T gid_t
| #define HAVE_GETGROUPS 1
| #define HAVE_GETMNTENT 1
| #define GETPGRP_VOID 1
| #define LSTAT_FOLLOWS_SLASHED_SYMLINK 1
| #define LSTAT_FOLLOWS_SLASHED_SYMLINK 1
| #define HAVE_STDLIB_H 1
| #define HAVE_MALLOC 1
| #define HAVE_STDLIB_H 1
| #define HAVE_SYS_TIME_H 1
| #define HAVE_UNISTD_H 1
| #define HAVE_ALARM 1
| #define HAVE_STDLIB_H 1
| #define HAVE_UNISTD_H 1
| #define HAVE_GETPAGESIZE 1
| #define HAVE_MMAP 1
| #define HAVE_STDLIB_H 1
| #define HAVE_REALLOC 1
| #define HAVE_SYS_SELECT_H 1
| #define HAVE_SYS_SOCKET_H 1
| #define SELECT_TYPE_ARG1 int
| #define SELECT_TYPE_ARG234 (fd_set *)
| #define SELECT_TYPE_ARG5 (struct timeval *)
| #define PROTOTYPES 1
| #define __PROTOTYPES 1
| #define HAVE_STRCOLL 1
| #define HAVE_DECL_STRERROR_R 1
| #define HAVE_STRERROR_R 1
| #define HAVE_STRFTIME 1
| #define HAVE_UTIME_NULL 1
| #define HAVE_VPRINTF 1
| /* end confdefs.h. */
| /* Define _doprnt to an innocuous variant, in case <limits.h> declares _doprnt.
| For example, HP-UX 11i <limits.h> declares gettimeofday. */
| #define _doprnt innocuous__doprnt
|
| /* System header to define __stub macros and hopefully few prototypes,
| which can conflict with char _doprnt (); below.
| Prefer <limits.h> to <assert.h> if __STDC__ is defined, since
| <limits.h> exists even on freestanding compilers. */
|
| #ifdef __STDC__
| # include <limits.h>
| #else
| # include <assert.h>
| #endif
|
| #undef _doprnt
|
| /* Override any gcc2 internal prototype to avoid an error. */
| #ifdef __cplusplus
| extern "C"
| {
| #endif
| /* We use char because int might match the return type of a gcc2
| builtin and then its argument prototype would still apply. */
| char _doprnt ();
| /* The GNU C library defines this for functions which it implements
| to always fail with ENOSYS. Some functions are actually named
| something starting with __ and the normal name is an alias. */
| #if defined (__stub__doprnt) || defined (__stub____doprnt)
| choke me
| #else
| char (*f) () = _doprnt;
| #endif
| #ifdef __cplusplus
| }
| #endif
|
| int
| main ()
| {
| return f != _doprnt;
| ;
| return 0;
| }
configure:12477: result: no
configure:12491: checking for wait3 that fills in rusage
configure:12542: gcc -o conftest -g -O2 conftest.c >&5
conftest.c: In function 'main':
conftest.c:127: warning: incompatible implicit declaration of built-in function '_exit'
conftest.c:136: warning: incompatible implicit declaration of built-in function 'exit'
configure:12545: $? = 0
configure:12547: ./conftest
configure:12550: $? = 0
configure:12564: result: yes
configure:12637: checking for alarm
configure:12725: result: yes
configure:12637: checking for atexit
configure:12694: gcc -o conftest -g -O2 conftest.c >&5
configure:12700: $? = 0
configure:12704: test -z
|| test ! -s conftest.err
configure:12707: $? = 0
configure:12710: test -s conftest
configure:12713: $? = 0
configure:12725: result: yes
configure:12637: checking for dup2
configure:12694: gcc -o conftest -g -O2 conftest.c >&5
configure:12700: $? = 0
configure:12704: test -z
|| test ! -s conftest.err
configure:12707: $? = 0
configure:12710: test -s conftest
configure:12713: $? = 0
configure:12725: result: yes
configure:12637: checking for endgrent
configure:12694: gcc -o conftest -g -O2 conftest.c >&5
configure:12700: $? = 0
configure:12704: test -z
|| test ! -s conftest.err
configure:12707: $? = 0
configure:12710: test -s conftest
configure:12713: $? = 0
configure:12725: result: yes
configure:12637: checking for endpwent
configure:12694: gcc -o conftest -g -O2 conftest.c >&5
configure:12700: $? = 0
configure:12704: test -z
|| test ! -s conftest.err
configure:12707: $? = 0
configure:12710: test -s conftest
configure:12713: $? = 0
configure:12725: result: yes
configure:12637: checking for ftruncate
configure:12694: gcc -o conftest -g -O2 conftest.c >&5
configure:12700: $? = 0
configure:12704: test -z
|| test ! -s conftest.err
configure:12707: $? = 0
configure:12710: test -s conftest
configure:12713: $? = 0
configure:12725: result: yes
configure:12637: checking for getcwd
configure:12694: gcc -o conftest -g -O2 conftest.c >&5
configure:12700: $? = 0
configure:12704: test -z
|| test ! -s conftest.err
configure:12707: $? = 0
configure:12710: test -s conftest
configure:12713: $? = 0
configure:12725: result: yes
configure:12637: checking for gethostbyaddr
configure:12694: gcc -o conftest -g -O2 conftest.c >&5
configure:12700: $? = 0
configure:12704: test -z
|| test ! -s conftest.err
configure:12707: $? = 0
configure:12710: test -s conftest
configure:12713: $? = 0
configure:12725: result: yes
configure:12637: checking for gethostbyname
configure:12694: gcc -o conftest -g -O2 conftest.c >&5
configure:12700: $? = 0
configure:12704: test -z
|| test ! -s conftest.err
configure:12707: $? = 0
configure:12710: test -s conftest
configure:12713: $? = 0
configure:12725: result: yes
configure:12637: checking for gethostname
configure:12694: gcc -o conftest -g -O2 conftest.c >&5
configure:12700: $? = 0
configure:12704: test -z
|| test ! -s conftest.err
configure:12707: $? = 0
configure:12710: test -s conftest
configure:12713: $? = 0
configure:12725: result: yes
configure:12637: checking for getmntent
configure:12725: result: yes
configure:12637: checking for getmntinfo
configure:12694: gcc -o conftest -g -O2 conftest.c >&5
/tmp/cccfpXyB.o: In function `main':
/home/amjad/svn/vertex/conftest.c:156: undefined reference to `getmntinfo'
/tmp/cccfpXyB.o:(.data+0x0): undefined reference to `getmntinfo'
collect2: ld returned 1 exit status
configure:12700: $? = 1
configure: failed program was:
| /* confdefs.h. */
|
| #define PACKAGE_NAME "vertex"
| #define PACKAGE_TARNAME "vertex"
| #define PACKAGE_VERSION "0.10"
| #define PACKAGE_STRING "vertex 0.10"
| #define PACKAGE_BUGREPORT "openvertex@googlegroups.com"
| #define PACKAGE "vertex"
| #define VERSION "0.10"
| #ifdef __cplusplus
| extern "C" void std::exit (int) throw (); using std::exit;
| #endif
| #define YYTEXT_POINTER 1
| #define HAVE_DIRENT_H 1
| #define STDC_HEADERS 1
| #define HAVE_SYS_TYPES_H 1
| #define HAVE_SYS_STAT_H 1
| #define HAVE_STDLIB_H 1
| #define HAVE_STRING_H 1
| #define HAVE_MEMORY_H 1
| #define HAVE_STRINGS_H 1
| #define HAVE_INTTYPES_H 1
| #define HAVE_STDINT_H 1
| #define HAVE_UNISTD_H 1
| #define HAVE_SYS_WAIT_H 1
| #define HAVE_ARPA_INET_H 1
| #define HAVE_FCNTL_H 1
| #define HAVE_INTTYPES_H 1
| #define HAVE_LIMITS_H 1
| #define HAVE_LOCALE_H 1
| #define HAVE_MNTENT_H 1
| #define HAVE_NETDB_H 1
| #define HAVE_NETINET_IN_H 1
| #define HAVE_PATHS_H 1
| #define HAVE_SHADOW_H 1
| #define HAVE_STDDEF_H 1
| #define HAVE_STDINT_H 1
| #define HAVE_STDLIB_H 1
| #define HAVE_STRING_H 1
| #define HAVE_STRINGS_H 1
| #define HAVE_SYS_FILE_H 1
| #define HAVE_SYS_IOCTL_H 1
| #define HAVE_SYS_MOUNT_H 1
| #define HAVE_SYS_PARAM_H 1
| #define HAVE_SYS_SOCKET_H 1
| #define HAVE_SYS_STATFS_H 1
| #define HAVE_SYS_STATVFS_H 1
| #define HAVE_SYS_TIME_H 1
| #define HAVE_SYS_VFS_H 1
| #define HAVE_SYSLOG_H 1
| #define HAVE_TERMIOS_H 1
| #define HAVE_UNISTD_H 1
| #define HAVE_UTIME_H 1
| #define HAVE_UTMP_H 1
| #define HAVE__BOOL 1
| #define HAVE_STDBOOL_H 1
| #define HAVE_STRUCT_STAT_ST_BLKSIZE 1
| #define HAVE_STRUCT_STAT_ST_BLOCKS 1
| #define HAVE_ST_BLOCKS 1
| #define HAVE_STRUCT_STAT_ST_RDEV 1
| #define TIME_WITH_SYS_TIME 1
| #define HAVE_PTRDIFF_T 1
| #define HAVE_ALLOCA_H 1
| #define HAVE_ALLOCA 1
| #define HAVE_UNISTD_H 1
| #define HAVE_CHOWN 1
| #define HAVE_MBSTATE_T 1
| #define HAVE_UNISTD_H 1
| #define HAVE_FORK 1
| #define HAVE_VFORK 1
| #define HAVE_WORKING_VFORK 1
| #define HAVE_WORKING_FORK 1
| #define GETGROUPS_T gid_t
| #define HAVE_GETGROUPS 1
| #define HAVE_GETMNTENT 1
| #define GETPGRP_VOID 1
| #define LSTAT_FOLLOWS_SLASHED_SYMLINK 1
| #define LSTAT_FOLLOWS_SLASHED_SYMLINK 1
| #define HAVE_STDLIB_H 1
| #define HAVE_MALLOC 1
| #define HAVE_STDLIB_H 1
| #define HAVE_SYS_TIME_H 1
| #define HAVE_UNISTD_H 1
| #define HAVE_ALARM 1
| #define HAVE_STDLIB_H 1
| #define HAVE_UNISTD_H 1
| #define HAVE_GETPAGESIZE 1
| #define HAVE_MMAP 1
| #define HAVE_STDLIB_H 1
| #define HAVE_REALLOC 1
| #define HAVE_SYS_SELECT_H 1
| #define HAVE_SYS_SOCKET_H 1
| #define SELECT_TYPE_ARG1 int
| #define SELECT_TYPE_ARG234 (fd_set *)
| #define SELECT_TYPE_ARG5 (struct timeval *)
| #define PROTOTYPES 1
| #define __PROTOTYPES 1
| #define HAVE_STRCOLL 1
| #define HAVE_DECL_STRERROR_R 1
| #define HAVE_STRERROR_R 1
| #define HAVE_STRFTIME 1
| #define HAVE_UTIME_NULL 1
| #define HAVE_VPRINTF 1
| #define HAVE_WAIT3 1
| #define HAVE_ALARM 1
| #define HAVE_ATEXIT 1
| #define HAVE_DUP2 1
| #define HAVE_ENDGRENT 1
| #define HAVE_ENDPWENT 1
| #define HAVE_FTRUNCATE 1
| #define HAVE_GETCWD 1
| #define HAVE_GETHOSTBYADDR 1
| #define HAVE_GETHOSTBYNAME 1
| #define HAVE_GETHOSTNAME 1
| #define HAVE_GETMNTENT 1
| /* end confdefs.h. */
| /* Define getmntinfo to an innocuous variant, in case <limits.h> declares getmntinfo.
| For example, HP-UX 11i <limits.h> declares gettimeofday. */
| #define getmntinfo innocuous_getmntinfo
|
| /* System header to define __stub macros and hopefully few prototypes,
| which can conflict with char getmntinfo (); below.
| Prefer <limits.h> to <assert.h> if __STDC__ is defined, since
| <limits.h> exists even on freestanding compilers. */
|
| #ifdef __STDC__
| # include <limits.h>
| #else
| # include <assert.h>
| #endif
|
| #undef getmntinfo
|
| /* Override any gcc2 internal prototype to avoid an error. */
| #ifdef __cplusplus
| extern "C"
| {
| #endif
| /* We use char because int might match the return type of a gcc2
| builtin and then its argument prototype would still apply. */
| char getmntinfo ();
| /* The GNU C library defines this for functions which it implements
| to always fail with ENOSYS. Some functions are actually named
| something starting with __ and the normal name is an alias. */
| #if defined (__stub_getmntinfo) || defined (__stub___getmntinfo)
| choke me
| #else
| char (*f) () = getmntinfo;
| #endif
| #ifdef __cplusplus
| }
| #endif
|
| int
| main ()
| {
| return f != getmntinfo;
| ;
| return 0;
| }
configure:12725: result: no
configure:12637: checking for getpagesize
configure:12725: result: yes
configure:12637: checking for getspnam
configure:12694: gcc -o conftest -g -O2 conftest.c >&5
configure:12700: $? = 0
configure:12704: test -z
|| test ! -s conftest.err
configure:12707: $? = 0
configure:12710: test -s conftest
configure:12713: $? = 0
configure:12725: result: yes
configure:12637: checking for gettimeofday
configure:12694: gcc -o conftest -g -O2 conftest.c >&5
configure:12700: $? = 0
configure:12704: test -z
|| test ! -s conftest.err
configure:12707: $? = 0
configure:12710: test -s conftest
configure:12713: $? = 0
configure:12725: result: yes
configure:12637: checking for getusershell
configure:12694: gcc -o conftest -g -O2 conftest.c >&5
configure:12700: $? = 0
configure:12704: test -z
|| test ! -s conftest.err
configure:12707: $? = 0
configure:12710: test -s conftest
configure:12713: $? = 0
configure:12725: result: yes
configure:12637: checking for hasmntopt
configure:12694: gcc -o conftest -g -O2 conftest.c >&5
configure:12700: $? = 0
configure:12704: test -z
|| test ! -s conftest.err
configure:12707: $? = 0
configure:12710: test -s conftest
configure:12713: $? = 0
configure:12725: result: yes
configure:12637: checking for inet_ntoa
configure:12694: gcc -o conftest -g -O2 conftest.c >&5
configure:12700: $? = 0
configure:12704: test -z
|| test ! -s conftest.err
configure:12707: $? = 0
configure:12710: test -s conftest
configure:12713: $? = 0
configure:12725: result: yes
configure:12637: checking for isascii
configure:12694: gcc -o conftest -g -O2 conftest.c >&5
conftest.c:147: warning: conflicting types for built-in function 'isascii'
configure:12700: $? = 0
configure:12704: test -z
|| test ! -s conftest.err
configure:12707: $? = 0
configure:12710: test -s conftest
configure:12713: $? = 0
configure:12725: result: yes
configure:12637: checking for lchown
configure:12694: gcc -o conftest -g -O2 conftest.c >&5
configure:12700: $? = 0
configure:12704: test -z
|| test ! -s conftest.err
configure:12707: $? = 0
configure:12710: test -s conftest
configure:12713: $? = 0
configure:12725: result: yes
configure:12637: checking for localtime_r
configure:12694: gcc -o conftest -g -O2 conftest.c >&5
configure:12700: $? = 0
configure:12704: test -z
|| test ! -s conftest.err
configure:12707: $? = 0
configure:12710: test -s conftest
configure:12713: $? = 0
configure:12725: result: yes
configure:12637: checking for memchr
configure:12694: gcc -o conftest -g -O2 conftest.c >&5
configure:12700: $? = 0
configure:12704: test -z
|| test ! -s conftest.err
configure:12707: $? = 0
configure:12710: test -s conftest
configure:12713: $? = 0
configure:12725: result: yes
configure:12637: checking for memmove
configure:12694: gcc -o conftest -g -O2 conftest.c >&5
conftest.c:151: warning: conflicting types for built-in function 'memmove'
configure:12700: $? = 0
configure:12704: test -z
|| test ! -s conftest.err
configure:12707: $? = 0
configure:12710: test -s conftest
configure:12713: $? = 0
configure:12725: result: yes
configure:12637: checking for mempcpy
configure:12694: gcc -o conftest -g -O2 conftest.c >&5
conftest.c:152: warning: conflicting types for built-in function 'mempcpy'
configure:12700: $? = 0
configure:12704: test -z
|| test ! -s conftest.err
configure:12707: $? = 0
configure:12710: test -s conftest
configure:12713: $? = 0
configure:12725: result: yes
configure:12637: checking for memset
configure:12694: gcc -o conftest -g -O2 conftest.c >&5
conftest.c:153: warning: conflicting types for built-in function 'memset'
configure:12700: $? = 0
configure:12704: test -z
|| test ! -s conftest.err
configure:12707: $? = 0
configure:12710: test -s conftest
configure:12713: $? = 0
configure:12725: result: yes
configure:12637: checking for mkdir
configure:12694: gcc -o conftest -g -O2 conftest.c >&5
configure:12700: $? = 0
configure:12704: test -z
|| test ! -s conftest.err
configure:12707: $? = 0
configure:12710: test -s conftest
configure:12713: $? = 0
configure:12725: result: yes
configure:12637: checking for mkfifo
configure:12694: gcc -o conftest -g -O2 conftest.c >&5
configure:12700: $? = 0
configure:12704: test -z
|| test ! -s conftest.err
configure:12707: $? = 0
configure:12710: test -s conftest
configure:12713: $? = 0
configure:12725: result: yes
configure:12637: checking for munmap
configure:12694: gcc -o conftest -g -O2 conftest.c >&5
configure:12700: $? = 0
configure:12704: test -z
|| test ! -s conftest.err
configure:12707: $? = 0
configure:12710: test -s conftest
configure:12713: $? = 0
configure:12725: result: yes
configure:12637: checking for pow
configure:12694: gcc -o conftest -g -O2 conftest.c >&5
conftest.c:157: warning: conflicting types for built-in function 'pow'
/tmp/ccUAWyuj.o: In function `main':
/home/amjad/svn/vertex/conftest.c:172: undefined reference to `pow'
/tmp/ccUAWyuj.o:(.data+0x0): undefined reference to `pow'
collect2: ld returned 1 exit status
configure:12700: $? = 1
configure: failed program was:
| /* confdefs.h. */
|
| #define PACKAGE_NAME "vertex"
| #define PACKAGE_TARNAME "vertex"
| #define PACKAGE_VERSION "0.10"
| #define PACKAGE_STRING "vertex 0.10"
| #define PACKAGE_BUGREPORT "openvertex@googlegroups.com"
| #define PACKAGE "vertex"
| #define VERSION "0.10"
| #ifdef __cplusplus
| extern "C" void std::exit (int) throw (); using std::exit;
| #endif
| #define YYTEXT_POINTER 1
| #define HAVE_DIRENT_H 1
| #define STDC_HEADERS 1
| #define HAVE_SYS_TYPES_H 1
| #define HAVE_SYS_STAT_H 1
| #define HAVE_STDLIB_H 1
| #define HAVE_STRING_H 1
| #define HAVE_MEMORY_H 1
| #define HAVE_STRINGS_H 1
| #define HAVE_INTTYPES_H 1
| #define HAVE_STDINT_H 1
| #define HAVE_UNISTD_H 1
| #define HAVE_SYS_WAIT_H 1
| #define HAVE_ARPA_INET_H 1
| #define HAVE_FCNTL_H 1
| #define HAVE_INTTYPES_H 1
| #define HAVE_LIMITS_H 1
| #define HAVE_LOCALE_H 1
| #define HAVE_MNTENT_H 1
| #define HAVE_NETDB_H 1
| #define HAVE_NETINET_IN_H 1
| #define HAVE_PATHS_H 1
| #define HAVE_SHADOW_H 1
| #define HAVE_STDDEF_H 1
| #define HAVE_STDINT_H 1
| #define HAVE_STDLIB_H 1
| #define HAVE_STRING_H 1
| #define HAVE_STRINGS_H 1
| #define HAVE_SYS_FILE_H 1
| #define HAVE_SYS_IOCTL_H 1
| #define HAVE_SYS_MOUNT_H 1
| #define HAVE_SYS_PARAM_H 1
| #define HAVE_SYS_SOCKET_H 1
| #define HAVE_SYS_STATFS_H 1
| #define HAVE_SYS_STATVFS_H 1
| #define HAVE_SYS_TIME_H 1
| #define HAVE_SYS_VFS_H 1
| #define HAVE_SYSLOG_H 1
| #define HAVE_TERMIOS_H 1
| #define HAVE_UNISTD_H 1
| #define HAVE_UTIME_H 1
| #define HAVE_UTMP_H 1
| #define HAVE__BOOL 1
| #define HAVE_STDBOOL_H 1
| #define HAVE_STRUCT_STAT_ST_BLKSIZE 1
| #define HAVE_STRUCT_STAT_ST_BLOCKS 1
| #define HAVE_ST_BLOCKS 1
| #define HAVE_STRUCT_STAT_ST_RDEV 1
| #define TIME_WITH_SYS_TIME 1
| #define HAVE_PTRDIFF_T 1
| #define HAVE_ALLOCA_H 1
| #define HAVE_ALLOCA 1
| #define HAVE_UNISTD_H 1
| #define HAVE_CHOWN 1
| #define HAVE_MBSTATE_T 1
| #define HAVE_UNISTD_H 1
| #define HAVE_FORK 1
| #define HAVE_VFORK 1
| #define HAVE_WORKING_VFORK 1
| #define HAVE_WORKING_FORK 1
| #define GETGROUPS_T gid_t
| #define HAVE_GETGROUPS 1
| #define HAVE_GETMNTENT 1
| #define GETPGRP_VOID 1
| #define LSTAT_FOLLOWS_SLASHED_SYMLINK 1
| #define LSTAT_FOLLOWS_SLASHED_SYMLINK 1
| #define HAVE_STDLIB_H 1
| #define HAVE_MALLOC 1
| #define HAVE_STDLIB_H 1
| #define HAVE_SYS_TIME_H 1
| #define HAVE_UNISTD_H 1
| #define HAVE_ALARM 1
| #define HAVE_STDLIB_H 1
| #define HAVE_UNISTD_H 1
| #define HAVE_GETPAGESIZE 1
| #define HAVE_MMAP 1
| #define HAVE_STDLIB_H 1
| #define HAVE_REALLOC 1
| #define HAVE_SYS_SELECT_H 1
| #define HAVE_SYS_SOCKET_H 1
| #define SELECT_TYPE_ARG1 int
| #define SELECT_TYPE_ARG234 (fd_set *)
| #define SELECT_TYPE_ARG5 (struct timeval *)
| #define PROTOTYPES 1
| #define __PROTOTYPES 1
| #define HAVE_STRCOLL 1
| #define HAVE_DECL_STRERROR_R 1
| #define HAVE_STRERROR_R 1
| #define HAVE_STRFTIME 1
| #define HAVE_UTIME_NULL 1
| #define HAVE_VPRINTF 1
| #define HAVE_WAIT3 1
| #define HAVE_ALARM 1
| #define HAVE_ATEXIT 1
| #define HAVE_DUP2 1
| #define HAVE_ENDGRENT 1
| #define HAVE_ENDPWENT 1
| #define HAVE_FTRUNCATE 1
| #define HAVE_GETCWD 1
| #define HAVE_GETHOSTBYADDR 1
| #define HAVE_GETHOSTBYNAME 1
| #define HAVE_GETHOSTNAME 1
| #define HAVE_GETMNTENT 1
| #define HAVE_GETPAGESIZE 1
| #define HAVE_GETSPNAM 1
| #define HAVE_GETTIMEOFDAY 1
| #define HAVE_GETUSERSHELL 1
| #define HAVE_HASMNTOPT 1
| #define HAVE_INET_NTOA 1
| #define HAVE_ISASCII 1
| #define HAVE_LCHOWN 1
| #define HAVE_LOCALTIME_R 1
| #define HAVE_MEMCHR 1
| #define HAVE_MEMMOVE 1
| #define HAVE_MEMPCPY 1
| #define HAVE_MEMSET 1
| #define HAVE_MKDIR 1
| #define HAVE_MKFIFO 1
| #define HAVE_MUNMAP 1
| /* end confdefs.h. */
| /* Define pow to an innocuous variant, in case <limits.h> declares pow.
| For example, HP-UX 11i <limits.h> declares gettimeofday. */
| #define pow innocuous_pow
|
| /* System header to define __stub macros and hopefully few prototypes,
| which can conflict with char pow (); below.
| Prefer <limits.h> to <assert.h> if __STDC__ is defined, since
| <limits.h> exists even on freestanding compilers. */
|
| #ifdef __STDC__
| # include <limits.h>
| #else
| # include <assert.h>
| #endif
|
| #undef pow
|
| /* Override any gcc2 internal prototype to avoid an error. */
| #ifdef __cplusplus
| extern "C"
| {
| #endif
| /* We use char because int might match the return type of a gcc2
| builtin and then its argument prototype would still apply. */
| char pow ();
| /* The GNU C library defines this for functions which it implements
| to always fail with ENOSYS. Some functions are actually named
| something starting with __ and the normal name is an alias. */
| #if defined (__stub_pow) || defined (__stub___pow)
| choke me
| #else
| char (*f) () = pow;
| #endif
| #ifdef __cplusplus
| }
| #endif
|
| int
| main ()
| {
| return f != pow;
| ;
| return 0;
| }
configure:12725: result: no
configure:12637: checking for putenv
configure:12694: gcc -o conftest -g -O2 conftest.c >&5
configure:12700: $? = 0
configure:12704: test -z
|| test ! -s conftest.err
configure:12707: $? = 0
configure:12710: test -s conftest
configure:12713: $? = 0
configure:12725: result: yes
configure:12637: checking for realpath
configure:12694: gcc -o conftest -g -O2 conftest.c >&5
configure:12700: $? = 0
configure:12704: test -z
|| test ! -s conftest.err
configure:12707: $? = 0
configure:12710: test -s conftest
configure:12713: $? = 0
configure:12725: result: yes
configure:12637: checking for regcomp
configure:12694: gcc -o conftest -g -O2 conftest.c >&5
configure:12700: $? = 0
configure:12704: test -z
|| test ! -s conftest.err
configure:12707: $? = 0
configure:12710: test -s conftest
configure:12713: $? = 0
configure:12725: result: yes
configure:12637: checking for rmdir
configure:12694: gcc -o conftest -g -O2 conftest.c >&5
configure:12700: $? = 0
configure:12704: test -z
|| test ! -s conftest.err
configure:12707: $? = 0
configure:12710: test -s conftest
configure:12713: $? = 0
configure:12725: result: yes
configure:12637: checking for select
configure:12694: gcc -o conftest -g -O2 conftest.c >&5
configure:12700: $? = 0
configure:12704: test -z
|| test ! -s conftest.err
configure:12707: $? = 0
configure:12710: test -s conftest
configure:12713: $? = 0
configure:12725: result: yes
configure:12637: checking for setenv
configure:12694: gcc -o conftest -g -O2 conftest.c >&5
configure:12700: $? = 0
configure:12704: test -z
|| test ! -s conftest.err
configure:12707: $? = 0
configure:12710: test -s conftest
configure:12713: $? = 0
configure:12725: result: yes
configure:12637: checking for sethostname
configure:12694: gcc -o conftest -g -O2 conftest.c >&5
configure:12700: $? = 0
configure:12704: test -z
|| test ! -s conftest.err
configure:12707: $? = 0
configure:12710: test -s conftest
configure:12713: $? = 0
configure:12725: result: yes
configure:12637: checking for setlocale
configure:12694: gcc -o conftest -g -O2 conftest.c >&5
configure:12700: $? = 0
configure:12704: test -z
|| test ! -s conftest.err
configure:12707: $? = 0
configure:12710: test -s conftest
configure:12713: $? = 0
configure:12725: result: yes
configure:12637: checking for socket
configure:12694: gcc -o conftest -g -O2 conftest.c >&5
configure:12700: $? = 0
configure:12704: test -z
|| test ! -s conftest.err
configure:12707: $? = 0
configure:12710: test -s conftest
configure:12713: $? = 0
configure:12725: result: yes
configure:12637: checking for sqrt
configure:12694: gcc -o conftest -g -O2 conftest.c >&5
conftest.c:166: warning: conflicting types for built-in function 'sqrt'
/tmp/ccmCICls.o: In function `main':
/home/amjad/svn/vertex/conftest.c:181: undefined reference to `sqrt'
/tmp/ccmCICls.o:(.data+0x0): undefined reference to `sqrt'
collect2: ld returned 1 exit status
configure:12700: $? = 1
configure: failed program was:
| /* confdefs.h. */
|
| #define PACKAGE_NAME "vertex"
| #define PACKAGE_TARNAME "vertex"
| #define PACKAGE_VERSION "0.10"
| #define PACKAGE_STRING "vertex 0.10"
| #define PACKAGE_BUGREPORT "openvertex@googlegroups.com"
| #define PACKAGE "vertex"
| #define VERSION "0.10"
| #ifdef __cplusplus
| extern "C" void std::exit (int) throw (); using std::exit;
| #endif
| #define YYTEXT_POINTER 1
| #define HAVE_DIRENT_H 1
| #define STDC_HEADERS 1
| #define HAVE_SYS_TYPES_H 1
| #define HAVE_SYS_STAT_H 1
| #define HAVE_STDLIB_H 1
| #define HAVE_STRING_H 1
| #define HAVE_MEMORY_H 1
| #define HAVE_STRINGS_H 1
| #define HAVE_INTTYPES_H 1
| #define HAVE_STDINT_H 1
| #define HAVE_UNISTD_H 1
| #define HAVE_SYS_WAIT_H 1
| #define HAVE_ARPA_INET_H 1
| #define HAVE_FCNTL_H 1
| #define HAVE_INTTYPES_H 1
| #define HAVE_LIMITS_H 1
| #define HAVE_LOCALE_H 1
| #define HAVE_MNTENT_H 1
| #define HAVE_NETDB_H 1
| #define HAVE_NETINET_IN_H 1
| #define HAVE_PATHS_H 1
| #define HAVE_SHADOW_H 1
| #define HAVE_STDDEF_H 1
| #define HAVE_STDINT_H 1
| #define HAVE_STDLIB_H 1
| #define HAVE_STRING_H 1
| #define HAVE_STRINGS_H 1
| #define HAVE_SYS_FILE_H 1
| #define HAVE_SYS_IOCTL_H 1
| #define HAVE_SYS_MOUNT_H 1
| #define HAVE_SYS_PARAM_H 1
| #define HAVE_SYS_SOCKET_H 1
| #define HAVE_SYS_STATFS_H 1
| #define HAVE_SYS_STATVFS_H 1
| #define HAVE_SYS_TIME_H 1
| #define HAVE_SYS_VFS_H 1
| #define HAVE_SYSLOG_H 1
| #define HAVE_TERMIOS_H 1
| #define HAVE_UNISTD_H 1
| #define HAVE_UTIME_H 1
| #define HAVE_UTMP_H 1
| #define HAVE__BOOL 1
| #define HAVE_STDBOOL_H 1
| #define HAVE_STRUCT_STAT_ST_BLKSIZE 1
| #define HAVE_STRUCT_STAT_ST_BLOCKS 1
| #define HAVE_ST_BLOCKS 1
| #define HAVE_STRUCT_STAT_ST_RDEV 1
| #define TIME_WITH_SYS_TIME 1
| #define HAVE_PTRDIFF_T 1
| #define HAVE_ALLOCA_H 1
| #define HAVE_ALLOCA 1
| #define HAVE_UNISTD_H 1
| #define HAVE_CHOWN 1
| #define HAVE_MBSTATE_T 1
| #define HAVE_UNISTD_H 1
| #define HAVE_FORK 1
| #define HAVE_VFORK 1
| #define HAVE_WORKING_VFORK 1
| #define HAVE_WORKING_FORK 1
| #define GETGROUPS_T gid_t
| #define HAVE_GETGROUPS 1
| #define HAVE_GETMNTENT 1
| #define GETPGRP_VOID 1
| #define LSTAT_FOLLOWS_SLASHED_SYMLINK 1
| #define LSTAT_FOLLOWS_SLASHED_SYMLINK 1
| #define HAVE_STDLIB_H 1
| #define HAVE_MALLOC 1
| #define HAVE_STDLIB_H 1
| #define HAVE_SYS_TIME_H 1
| #define HAVE_UNISTD_H 1
| #define HAVE_ALARM 1
| #define HAVE_STDLIB_H 1
| #define HAVE_UNISTD_H 1
| #define HAVE_GETPAGESIZE 1
| #define HAVE_MMAP 1
| #define HAVE_STDLIB_H 1
| #define HAVE_REALLOC 1
| #define HAVE_SYS_SELECT_H 1
| #define HAVE_SYS_SOCKET_H 1
| #define SELECT_TYPE_ARG1 int
| #define SELECT_TYPE_ARG234 (fd_set *)
| #define SELECT_TYPE_ARG5 (struct timeval *)
| #define PROTOTYPES 1
| #define __PROTOTYPES 1
| #define HAVE_STRCOLL 1
| #define HAVE_DECL_STRERROR_R 1
| #define HAVE_STRERROR_R 1
| #define HAVE_STRFTIME 1
| #define HAVE_UTIME_NULL 1
| #define HAVE_VPRINTF 1
| #define HAVE_WAIT3 1
| #define HAVE_ALARM 1
| #define HAVE_ATEXIT 1
| #define HAVE_DUP2 1
| #define HAVE_ENDGRENT 1
| #define HAVE_ENDPWENT 1
| #define HAVE_FTRUNCATE 1
| #define HAVE_GETCWD 1
| #define HAVE_GETHOSTBYADDR 1
| #define HAVE_GETHOSTBYNAME 1
| #define HAVE_GETHOSTNAME 1
| #define HAVE_GETMNTENT 1
| #define HAVE_GETPAGESIZE 1
| #define HAVE_GETSPNAM 1
| #define HAVE_GETTIMEOFDAY 1
| #define HAVE_GETUSERSHELL 1
| #define HAVE_HASMNTOPT 1
| #define HAVE_INET_NTOA 1
| #define HAVE_ISASCII 1
| #define HAVE_LCHOWN 1
| #define HAVE_LOCALTIME_R 1
| #define HAVE_MEMCHR 1
| #define HAVE_MEMMOVE 1
| #define HAVE_MEMPCPY 1
| #define HAVE_MEMSET 1
| #define HAVE_MKDIR 1
| #define HAVE_MKFIFO 1
| #define HAVE_MUNMAP 1
| #define HAVE_PUTENV 1
| #define HAVE_REALPATH 1
| #define HAVE_REGCOMP 1
| #define HAVE_RMDIR 1
| #define HAVE_SELECT 1
| #define HAVE_SETENV 1
| #define HAVE_SETHOSTNAME 1
| #define HAVE_SETLOCALE 1
| #define HAVE_SOCKET 1
| /* end confdefs.h. */
| /* Define sqrt to an innocuous variant, in case <limits.h> declares sqrt.
| For example, HP-UX 11i <limits.h> declares gettimeofday. */
| #define sqrt innocuous_sqrt
|
| /* System header to define __stub macros and hopefully few prototypes,
| which can conflict with char sqrt (); below.
| Prefer <limits.h> to <assert.h> if __STDC__ is defined, since
| <limits.h> exists even on freestanding compilers. */
|
| #ifdef __STDC__
| # include <limits.h>
| #else
| # include <assert.h>
| #endif
|
| #undef sqrt
|
| /* Override any gcc2 internal prototype to avoid an error. */
| #ifdef __cplusplus
| extern "C"
| {
| #endif
| /* We use char because int might match the return type of a gcc2
| builtin and then its argument prototype would still apply. */
| char sqrt ();
| /* The GNU C library defines this for functions which it implements
| to always fail with ENOSYS. Some functions are actually named
| something starting with __ and the normal name is an alias. */
| #if defined (__stub_sqrt) || defined (__stub___sqrt)
| choke me
| #else
| char (*f) () = sqrt;
| #endif
| #ifdef __cplusplus
| }
| #endif
|
| int
| main ()
| {
| return f != sqrt;
| ;
| return 0;
| }
configure:12725: result: no
configure:12637: checking for stime
configure:12694: gcc -o conftest -g -O2 conftest.c >&5
configure:12700: $? = 0
configure:12704: test -z
|| test ! -s conftest.err
configure:12707: $? = 0
configure:12710: test -s conftest
configure:12713: $? = 0
configure:12725: result: yes
configure:12637: checking for stpcpy
configure:12694: gcc -o conftest -g -O2 conftest.c >&5
conftest.c:167: warning: conflicting types for built-in function 'stpcpy'
configure:12700: $? = 0
configure:12704: test -z
|| test ! -s conftest.err
configure:12707: $? = 0
configure:12710: test -s conftest
configure:12713: $? = 0
configure:12725: result: yes
configure:12637: checking for strcasecmp
configure:12694: gcc -o conftest -g -O2 conftest.c >&5
conftest.c:168: warning: conflicting types for built-in function 'strcasecmp'
configure:12700: $? = 0
configure:12704: test -z
|| test ! -s conftest.err
configure:12707: $? = 0
configure:12710: test -s conftest
configure:12713: $? = 0
configure:12725: result: yes
configure:12637: checking for strchr
configure:12694: gcc -o conftest -g -O2 conftest.c >&5
conftest.c:169: warning: conflicting types for built-in function 'strchr'
configure:12700: $? = 0
configure:12704: test -z
|| test ! -s conftest.err
configure:12707: $? = 0
configure:12710: test -s conftest
configure:12713: $? = 0
configure:12725: result: yes
configure:12637: checking for strcspn
configure:12694: gcc -o conftest -g -O2 conftest.c >&5
conftest.c:170: warning: conflicting types for built-in function 'strcspn'
configure:12700: $? = 0
configure:12704: test -z
|| test ! -s conftest.err
configure:12707: $? = 0
configure:12710: test -s conftest
configure:12713: $? = 0
configure:12725: result: yes
configure:12637: checking for strdup
configure:12694: gcc -o conftest -g -O2 conftest.c >&5
conftest.c:171: warning: conflicting types for built-in function 'strdup'
configure:12700: $? = 0
configure:12704: test -z
|| test ! -s conftest.err
configure:12707: $? = 0
configure:12710: test -s conftest
configure:12713: $? = 0
configure:12725: result: yes
configure:12637: checking for strerror
configure:12694: gcc -o conftest -g -O2 conftest.c >&5
configure:12700: $? = 0
configure:12704: test -z
|| test ! -s conftest.err
configure:12707: $? = 0
configure:12710: test -s conftest
configure:12713: $? = 0
configure:12725: result: yes
configure:12637: checking for strncasecmp
configure:12694: gcc -o conftest -g -O2 conftest.c >&5
conftest.c:173: warning: conflicting types for built-in function 'strncasecmp'
configure:12700: $? = 0
configure:12704: test -z
|| test ! -s conftest.err
configure:12707: $? = 0
configure:12710: test -s conftest
configure:12713: $? = 0
configure:12725: result: yes
configure:12637: checking for strndup
configure:12694: gcc -o conftest -g -O2 conftest.c >&5
conftest.c:174: warning: conflicting types for built-in function 'strndup'
configure:12700: $? = 0
configure:12704: test -z
|| test ! -s conftest.err
configure:12707: $? = 0
configure:12710: test -s conftest
configure:12713: $? = 0
configure:12725: result: yes
configure:12637: checking for strpbrk
configure:12694: gcc -o conftest -g -O2 conftest.c >&5
conftest.c:175: warning: conflicting types for built-in function 'strpbrk'
configure:12700: $? = 0
configure:12704: test -z
|| test ! -s conftest.err
configure:12707: $? = 0
configure:12710: test -s conftest
configure:12713: $? = 0
configure:12725: result: yes
configure:12637: checking for strrchr
configure:12694: gcc -o conftest -g -O2 conftest.c >&5
conftest.c:176: warning: conflicting types for built-in function 'strrchr'
configure:12700: $? = 0
configure:12704: test -z
|| test ! -s conftest.err
configure:12707: $? = 0
configure:12710: test -s conftest
configure:12713: $? = 0
configure:12725: result: yes
configure:12637: checking for strspn
configure:12694: gcc -o conftest -g -O2 conftest.c >&5
conftest.c:177: warning: conflicting types for built-in function 'strspn'
configure:12700: $? = 0
configure:12704: test -z
|| test ! -s conftest.err
configure:12707: $? = 0
configure:12710: test -s conftest
configure:12713: $? = 0
configure:12725: result: yes
configure:12637: checking for strstr
configure:12694: gcc -o conftest -g -O2 conftest.c >&5
conftest.c:178: warning: conflicting types for built-in function 'strstr'
configure:12700: $? = 0
configure:12704: test -z
|| test ! -s conftest.err
configure:12707: $? = 0
configure:12710: test -s conftest
configure:12713: $? = 0
configure:12725: result: yes
configure:12637: checking for strtol
configure:12694: gcc -o conftest -g -O2 conftest.c >&5
configure:12700: $? = 0
configure:12704: test -z
|| test ! -s conftest.err
configure:12707: $? = 0
configure:12710: test -s conftest
configure:12713: $? = 0
configure:12725: result: yes
configure:12637: checking for strtoul
configure:12694: gcc -o conftest -g -O2 conftest.c >&5
configure:12700: $? = 0
configure:12704: test -z
|| test ! -s conftest.err
configure:12707: $? = 0
configure:12710: test -s conftest
configure:12713: $? = 0
configure:12725: result: yes
configure:12637: checking for strtoull
configure:12694: gcc -o conftest -g -O2 conftest.c >&5
configure:12700: $? = 0
configure:12704: test -z
|| test ! -s conftest.err
configure:12707: $? = 0
configure:12710: test -s conftest
configure:12713: $? = 0
configure:12725: result: yes
configure:12637: checking for sysinfo
configure:12694: gcc -o conftest -g -O2 conftest.c >&5
configure:12700: $? = 0
configure:12704: test -z
|| test ! -s conftest.err
configure:12707: $? = 0
configure:12710: test -s conftest
configure:12713: $? = 0
configure:12725: result: yes
configure:12637: checking for tzset
configure:12694: gcc -o conftest -g -O2 conftest.c >&5
configure:12700: $? = 0
configure:12704: test -z
|| test ! -s conftest.err
configure:12707: $? = 0
configure:12710: test -s conftest
configure:12713: $? = 0
configure:12725: result: yes
configure:12637: checking for uname
configure:12694: gcc -o conftest -g -O2 conftest.c >&5
configure:12700: $? = 0
configure:12704: test -z
|| test ! -s conftest.err
configure:12707: $? = 0
configure:12710: test -s conftest
configure:12713: $? = 0
configure:12725: result: yes
configure:12637: checking for utime
configure:12694: gcc -o conftest -g -O2 conftest.c >&5
configure:12700: $? = 0
configure:12704: test -z
|| test ! -s conftest.err
configure:12707: $? = 0
configure:12710: test -s conftest
configure:12713: $? = 0
configure:12725: result: yes
configure:12637: checking for utmpname
configure:12694: gcc -o conftest -g -O2 conftest.c >&5
configure:12700: $? = 0
configure:12704: test -z
|| test ! -s conftest.err
configure:12707: $? = 0
configure:12710: test -s conftest
configure:12713: $? = 0
configure:12725: result: yes
configure:12862: creating ./config.status
## ---------------------- ##
## Running config.status. ##
## ---------------------- ##
This file was extended by vertex config.status 0.10, which was
generated by GNU Autoconf 2.59. Invocation command line was
CONFIG_FILES =
CONFIG_HEADERS =
CONFIG_LINKS =
CONFIG_COMMANDS =
$ ./config.status
on greghub
config.status:729: creating Makefile
config.status:729: creating etc/vex
config.status:729: creating vexinit/vex.sh
config.status:729: creating xcpu2/libstrutil/Makefile
config.status:729: creating xcpu2/libxcpu/Makefile
config.status:729: creating xcpu2/libxauth/Makefile
config.status:729: creating xcpu2/spfs/libspfs/Makefile
config.status:729: creating xcpu2/spfs/libspclient/Makefile
config.status:729: creating xcpu2/spfs/fs/Makefile
config.status:729: creating xcpu2/spfs/Makefile
config.status:729: creating xcpu2/npfs/libnpfs/Makefile
config.status:729: creating xcpu2/npfs/libnpclient/Makefile
config.status:729: creating xcpu2/npfs/fs/Makefile
config.status:729: creating xcpu2/npfs/Makefile
config.status:729: creating xcpu2/statfs/Makefile
config.status:729: creating xcpu2/utils/Makefile
config.status:729: creating xcpu2/xcpufs/Makefile
config.status:729: creating xcpu2/Makefile
config.status:833: creating config.h
config.status:1287: config.h is unchanged
config.status:1603: executing depfiles commands
## ---------------- ##
## Cache variables. ##
## ---------------- ##
ac_cv_c_compiler_gnu=yes
ac_cv_c_const=yes
ac_cv_c_inline=inline
ac_cv_c_volatile=yes
ac_cv_cxx_compiler_gnu=yes
ac_cv_env_CC_set=
ac_cv_env_CC_value=
ac_cv_env_CFLAGS_set=
ac_cv_env_CFLAGS_value=
ac_cv_env_CPPFLAGS_set=
ac_cv_env_CPPFLAGS_value=
ac_cv_env_CPP_set=
ac_cv_env_CPP_value=
ac_cv_env_CXXFLAGS_set=
ac_cv_env_CXXFLAGS_value=
ac_cv_env_CXX_set=
ac_cv_env_CXX_value=
ac_cv_env_LDFLAGS_set=
ac_cv_env_LDFLAGS_value=
ac_cv_env_build_alias_set=
ac_cv_env_build_alias_value=
ac_cv_env_host_alias_set=
ac_cv_env_host_alias_value=
ac_cv_env_target_alias_set=
ac_cv_env_target_alias_value=
ac_cv_exeext=
ac_cv_func__doprnt=no
ac_cv_func_alarm=yes
ac_cv_func_alloca_works=yes
ac_cv_func_atexit=yes
ac_cv_func_chown_works=yes
ac_cv_func_closedir_void=no
ac_cv_func_dup2=yes
ac_cv_func_endgrent=yes
ac_cv_func_endpwent=yes
ac_cv_func_fnmatch_works=yes
ac_cv_func_fork=yes
ac_cv_func_fork_works=yes
ac_cv_func_ftruncate=yes
ac_cv_func_getcwd=yes
ac_cv_func_getgroups=yes
ac_cv_func_getgroups_works=yes
ac_cv_func_gethostbyaddr=yes
ac_cv_func_gethostbyname=yes
ac_cv_func_gethostname=yes
ac_cv_func_getmntent=yes
ac_cv_func_getmntinfo=no
ac_cv_func_getpagesize=yes
ac_cv_func_getpgrp_void=yes
ac_cv_func_getspnam=yes
ac_cv_func_gettimeofday=yes
ac_cv_func_getusershell=yes
ac_cv_func_hasmntopt=yes
ac_cv_func_inet_ntoa=yes
ac_cv_func_isascii=yes
ac_cv_func_lchown=yes
ac_cv_func_localtime_r=yes
ac_cv_func_lstat_dereferences_slashed_symlink=yes
ac_cv_func_lstat_empty_string_bug=no
ac_cv_func_malloc_0_nonnull=yes
ac_cv_func_memchr=yes
ac_cv_func_memcmp_working=yes
ac_cv_func_memmove=yes
ac_cv_func_mempcpy=yes
ac_cv_func_memset=yes
ac_cv_func_mkdir=yes
ac_cv_func_mkfifo=yes
ac_cv_func_mmap_fixed_mapped=yes
ac_cv_func_munmap=yes
ac_cv_func_pow=no
ac_cv_func_putenv=yes
ac_cv_func_realloc_0_nonnull=yes
ac_cv_func_realpath=yes
ac_cv_func_regcomp=yes
ac_cv_func_rmdir=yes
ac_cv_func_select=yes
ac_cv_func_select_args='int,fd_set *,struct timeval *'
ac_cv_func_setenv=yes
ac_cv_func_sethostname=yes
ac_cv_func_setlocale=yes
ac_cv_func_setvbuf_reversed=no
ac_cv_func_socket=yes
ac_cv_func_sqrt=no
ac_cv_func_stat_empty_string_bug=no
ac_cv_func_stime=yes
ac_cv_func_stpcpy=yes
ac_cv_func_strcasecmp=yes
ac_cv_func_strchr=yes
ac_cv_func_strcoll_works=yes
ac_cv_func_strcspn=yes
ac_cv_func_strdup=yes
ac_cv_func_strerror=yes
ac_cv_func_strerror_r=yes
ac_cv_func_strerror_r_char_p=no
ac_cv_func_strftime=yes
ac_cv_func_strncasecmp=yes
ac_cv_func_strndup=yes
ac_cv_func_strnlen_working=yes
ac_cv_func_strpbrk=yes
ac_cv_func_strrchr=yes
ac_cv_func_strspn=yes
ac_cv_func_strstr=yes
ac_cv_func_strtod=yes
ac_cv_func_strtol=yes
ac_cv_func_strtoul=yes
ac_cv_func_strtoull=yes
ac_cv_func_sysinfo=yes
ac_cv_func_tzset=yes
ac_cv_func_uname=yes
ac_cv_func_utime=yes
ac_cv_func_utime_null=yes
ac_cv_func_utmpname=yes
ac_cv_func_vfork=yes
ac_cv_func_vfork_works=yes
ac_cv_func_vprintf=yes
ac_cv_func_wait3_rusage=yes
ac_cv_func_working_mktime=yes
ac_cv_have_decl_strerror_r=yes
ac_cv_header_arpa_inet_h=yes
ac_cv_header_dirent_dirent_h=yes
ac_cv_header_fcntl_h=yes
ac_cv_header_inttypes_h=yes
ac_cv_header_limits_h=yes
ac_cv_header_locale_h=yes
ac_cv_header_memory_h=yes
ac_cv_header_mntent_h=yes
ac_cv_header_netdb_h=yes
ac_cv_header_netinet_in_h=yes
ac_cv_header_paths_h=yes
ac_cv_header_shadow_h=yes
ac_cv_header_stdbool_h=yes
ac_cv_header_stdc=yes
ac_cv_header_stddef_h=yes
ac_cv_header_stdint_h=yes
ac_cv_header_stdlib_h=yes
ac_cv_header_string_h=yes
ac_cv_header_strings_h=yes
ac_cv_header_sys_file_h=yes
ac_cv_header_sys_ioctl_h=yes
ac_cv_header_sys_mount_h=yes
ac_cv_header_sys_param_h=yes
ac_cv_header_sys_select_h=yes
ac_cv_header_sys_socket_h=yes
ac_cv_header_sys_stat_h=yes
ac_cv_header_sys_statfs_h=yes
ac_cv_header_sys_statvfs_h=yes
ac_cv_header_sys_time_h=yes
ac_cv_header_sys_types_h=yes
ac_cv_header_sys_types_h_makedev=yes
ac_cv_header_sys_vfs_h=yes
ac_cv_header_sys_wait_h=yes
ac_cv_header_syslog_h=yes
ac_cv_header_termios_h=yes
ac_cv_header_time=yes
ac_cv_header_unistd_h=yes
ac_cv_header_utime_h=yes
ac_cv_header_utmp_h=yes
ac_cv_header_vfork_h=no
ac_cv_lib_aio_main=yes
ac_cv_lib_error_at_line=yes
ac_cv_lib_fl_yywrap=yes
ac_cv_lib_gen_getmntent=no
ac_cv_lib_seq_getmntent=no
ac_cv_lib_sun_getmntent=no
ac_cv_member_struct_stat_st_blksize=yes
ac_cv_member_struct_stat_st_blocks=yes
ac_cv_member_struct_stat_st_rdev=yes
ac_cv_objext=o
ac_cv_path_install='/usr/bin/install -c'
ac_cv_prog_AWK=gawk
ac_cv_prog_CPP='gcc -E'
ac_cv_prog_LEX=flex
ac_cv_prog_YACC='bison -y'
ac_cv_prog_ac_ct_CC=gcc
ac_cv_prog_ac_ct_CXX=g++
ac_cv_prog_ac_ct_RANLIB=ranlib
ac_cv_prog_cc_g=yes
ac_cv_prog_cc_gcc_c_o=yes
ac_cv_prog_cc_stdc=
ac_cv_prog_cxx_g=yes
ac_cv_prog_egrep='grep -E'
ac_cv_prog_gcc_traditional=no
ac_cv_prog_lex_root=lex.yy
ac_cv_prog_lex_yytext_pointer=yes
ac_cv_prog_make_make_set=yes
ac_cv_search_opendir='none required'
ac_cv_struct_tm=time.h
ac_cv_type__Bool=yes
ac_cv_type_getgroups=gid_t
ac_cv_type_mbstate_t=yes
ac_cv_type_mode_t=yes
ac_cv_type_off_t=yes
ac_cv_type_pid_t=yes
ac_cv_type_ptrdiff_t=yes
ac_cv_type_size_t=yes
ac_cv_type_uid_t=yes
ac_cv_working_alloca_h=yes
am_cv_CC_dependencies_compiler_type=gcc3
am_cv_CXX_dependencies_compiler_type=gcc3
## ----------------- ##
## Output variables. ##
## ----------------- ##
ACLOCAL='${SHELL} /home/amjad/svn/vertex/missing --run aclocal-1.9'
ALLOCA=''
AMDEPBACKSLASH='\'
AMDEP_FALSE='#'
AMDEP_TRUE=''
AMTAR='${SHELL} /home/amjad/svn/vertex/missing --run tar'
AUTOCONF='${SHELL} /home/amjad/svn/vertex/missing --run autoconf'
AUTOHEADER='${SHELL} /home/amjad/svn/vertex/missing --run autoheader'
AUTOMAKE='${SHELL} /home/amjad/svn/vertex/missing --run automake-1.9'
AWK='gawk'
CC='gcc'
CCDEPMODE='depmode=gcc3'
CFLAGS='-g -O2'
CPP='gcc -E'
CPPFLAGS=''
CXX='g++'
CXXDEPMODE='depmode=gcc3'
CXXFLAGS='-g -O2'
CYGPATH_W='echo'
DEFS='-DHAVE_CONFIG_H'
DEPDIR='.deps'
ECHO_C=''
ECHO_N='-n'
ECHO_T=''
EGREP='grep -E'
EXEEXT=''
INSTALL_DATA='${INSTALL} -m 644'
INSTALL_PROGRAM='${INSTALL}'
INSTALL_SCRIPT='${INSTALL}'
INSTALL_STRIP_PROGRAM='${SHELL} $(install_sh) -c -s'
LDFLAGS=''
LEX='flex'
LEXLIB='-lfl'
LEX_OUTPUT_ROOT='lex.yy'
LIBOBJS=''
LIBS=''
LN_S='ln -s'
LTLIBOBJS=''
MAKEINFO='${SHELL} /home/amjad/svn/vertex/missing --run makeinfo'
OBJEXT='o'
PACKAGE='vertex'
PACKAGE_BUGREPORT='openvertex@googlegroups.com'
PACKAGE_NAME='vertex'
PACKAGE_STRING='vertex 0.10'
PACKAGE_TARNAME='vertex'
PACKAGE_VERSION='0.10'
PATH_SEPARATOR=':'
POW_LIB=''
RANLIB='ranlib'
SET_MAKE=''
SHELL='/bin/sh'
STRIP=''
VERSION='0.10'
YACC='bison -y'
ac_ct_CC='gcc'
ac_ct_CXX='g++'
ac_ct_RANLIB='ranlib'
ac_ct_STRIP=''
am__fastdepCC_FALSE='#'
am__fastdepCC_TRUE=''
am__fastdepCXX_FALSE='#'
am__fastdepCXX_TRUE=''
am__include='include'
am__leading_dot='.'
am__quote=''
am__tar='${AMTAR} chof - "$$tardir"'
am__untar='${AMTAR} xf -'
bindir='${exec_prefix}/bin'
build_alias=''
configfile='/var/vertex'
datadir='${prefix}/share'
exec_prefix='${prefix}'
host_alias=''
includedir='${prefix}/include'
infodir='${prefix}/info'
install_sh='/home/amjad/svn/vertex/install-sh'
libdir='${exec_prefix}/lib'
libexecdir='${exec_prefix}/libexec'
localstatedir='${prefix}/var'
mandir='${prefix}/man'
mkdir_p='mkdir -p --'
oldincludedir='/usr/include'
prefix='/usr/local/vertex'
program_transform_name='s,x,x,'
sbindir='${exec_prefix}/sbin'
sharedstatedir='${prefix}/com'
sysconfdir='${prefix}/etc'
sysrootfile='/var/vertex/SYSROOT'
target_alias=''
uidmethod='local'
## ----------- ##
## confdefs.h. ##
## ----------- ##
#define GETGROUPS_T gid_t
#define GETPGRP_VOID 1
#define HAVE_ALARM 1
#define HAVE_ALARM 1
#define HAVE_ALLOCA 1
#define HAVE_ALLOCA_H 1
#define HAVE_ARPA_INET_H 1
#define HAVE_ATEXIT 1
#define HAVE_CHOWN 1
#define HAVE_DECL_STRERROR_R 1
#define HAVE_DIRENT_H 1
#define HAVE_DUP2 1
#define HAVE_ENDGRENT 1
#define HAVE_ENDPWENT 1
#define HAVE_FCNTL_H 1
#define HAVE_FORK 1
#define HAVE_FTRUNCATE 1
#define HAVE_GETCWD 1
#define HAVE_GETGROUPS 1
#define HAVE_GETHOSTBYADDR 1
#define HAVE_GETHOSTBYNAME 1
#define HAVE_GETHOSTNAME 1
#define HAVE_GETMNTENT 1
#define HAVE_GETMNTENT 1
#define HAVE_GETPAGESIZE 1
#define HAVE_GETPAGESIZE 1
#define HAVE_GETSPNAM 1
#define HAVE_GETTIMEOFDAY 1
#define HAVE_GETUSERSHELL 1
#define HAVE_HASMNTOPT 1
#define HAVE_INET_NTOA 1
#define HAVE_INTTYPES_H 1
#define HAVE_INTTYPES_H 1
#define HAVE_ISASCII 1
#define HAVE_LCHOWN 1
#define HAVE_LIMITS_H 1
#define HAVE_LOCALE_H 1
#define HAVE_LOCALTIME_R 1
#define HAVE_MALLOC 1
#define HAVE_MBSTATE_T 1
#define HAVE_MEMCHR 1
#define HAVE_MEMMOVE 1
#define HAVE_MEMORY_H 1
#define HAVE_MEMPCPY 1
#define HAVE_MEMSET 1
#define HAVE_MKDIR 1
#define HAVE_MKFIFO 1
#define HAVE_MMAP 1
#define HAVE_MNTENT_H 1
#define HAVE_MUNMAP 1
#define HAVE_NETDB_H 1
#define HAVE_NETINET_IN_H 1
#define HAVE_PATHS_H 1
#define HAVE_PTRDIFF_T 1
#define HAVE_PUTENV 1
#define HAVE_REALLOC 1
#define HAVE_REALPATH 1
#define HAVE_REGCOMP 1
#define HAVE_RMDIR 1
#define HAVE_SELECT 1
#define HAVE_SETENV 1
#define HAVE_SETHOSTNAME 1
#define HAVE_SETLOCALE 1
#define HAVE_SHADOW_H 1
#define HAVE_SOCKET 1
#define HAVE_STDBOOL_H 1
#define HAVE_STDDEF_H 1
#define HAVE_STDINT_H 1
#define HAVE_STDINT_H 1
#define HAVE_STDLIB_H 1
#define HAVE_STDLIB_H 1
#define HAVE_STDLIB_H 1
#define HAVE_STDLIB_H 1
#define HAVE_STDLIB_H 1
#define HAVE_STDLIB_H 1
#define HAVE_STIME 1
#define HAVE_STPCPY 1
#define HAVE_STRCASECMP 1
#define HAVE_STRCHR 1
#define HAVE_STRCOLL 1
#define HAVE_STRCSPN 1
#define HAVE_STRDUP 1
#define HAVE_STRERROR 1
#define HAVE_STRERROR_R 1
#define HAVE_STRFTIME 1
#define HAVE_STRINGS_H 1
#define HAVE_STRINGS_H 1
#define HAVE_STRING_H 1
#define HAVE_STRING_H 1
#define HAVE_STRNCASECMP 1
#define HAVE_STRNDUP 1
#define HAVE_STRPBRK 1
#define HAVE_STRRCHR 1
#define HAVE_STRSPN 1
#define HAVE_STRSTR 1
#define HAVE_STRTOL 1
#define HAVE_STRTOUL 1
#define HAVE_STRTOULL 1
#define HAVE_STRUCT_STAT_ST_BLKSIZE 1
#define HAVE_STRUCT_STAT_ST_BLOCKS 1
#define HAVE_STRUCT_STAT_ST_RDEV 1
#define HAVE_ST_BLOCKS 1
#define HAVE_SYSINFO 1
#define HAVE_SYSLOG_H 1
#define HAVE_SYS_FILE_H 1
#define HAVE_SYS_IOCTL_H 1
#define HAVE_SYS_MOUNT_H 1
#define HAVE_SYS_PARAM_H 1
#define HAVE_SYS_SELECT_H 1
#define HAVE_SYS_SOCKET_H 1
#define HAVE_SYS_SOCKET_H 1
#define HAVE_SYS_STATFS_H 1
#define HAVE_SYS_STATVFS_H 1
#define HAVE_SYS_STAT_H 1
#define HAVE_SYS_TIME_H 1
#define HAVE_SYS_TIME_H 1
#define HAVE_SYS_TYPES_H 1
#define HAVE_SYS_VFS_H 1
#define HAVE_SYS_WAIT_H 1
#define HAVE_TERMIOS_H 1
#define HAVE_TZSET 1
#define HAVE_UNAME 1
#define HAVE_UNISTD_H 1
#define HAVE_UNISTD_H 1
#define HAVE_UNISTD_H 1
#define HAVE_UNISTD_H 1
#define HAVE_UNISTD_H 1
#define HAVE_UNISTD_H 1
#define HAVE_UTIME 1
#define HAVE_UTIME_H 1
#define HAVE_UTIME_NULL 1
#define HAVE_UTMPNAME 1
#define HAVE_UTMP_H 1
#define HAVE_VFORK 1
#define HAVE_VPRINTF 1
#define HAVE_WAIT3 1
#define HAVE_WORKING_FORK 1
#define HAVE_WORKING_VFORK 1
#define HAVE__BOOL 1
#define LSTAT_FOLLOWS_SLASHED_SYMLINK 1
#define LSTAT_FOLLOWS_SLASHED_SYMLINK 1
#define PACKAGE "vertex"
#define PACKAGE_BUGREPORT "openvertex@googlegroups.com"
#define PACKAGE_NAME "vertex"
#define PACKAGE_STRING "vertex 0.10"
#define PACKAGE_TARNAME "vertex"
#define PACKAGE_VERSION "0.10"
#define PROTOTYPES 1
#define SELECT_TYPE_ARG1 int
#define SELECT_TYPE_ARG234 (fd_set *)
#define SELECT_TYPE_ARG5 (struct timeval *)
#define STDC_HEADERS 1
#define TIME_WITH_SYS_TIME 1
#define VERSION "0.10"
#define YYTEXT_POINTER 1
#define __PROTOTYPES 1
#endif
#ifdef __cplusplus
extern "C" void std::exit (int) throw (); using std::exit;
configure: exit 0
Jump to Line
Something went wrong with that request. Please try again.