Permalink
Branch: master
Find file Copy path
Fetching contributors…
Cannot retrieve contributors at this time
1181 lines (1179 sloc) 39.8 KB
globals:
- environments: &environments_arm64
- hi6220-hikey
- juno-r2
- dragonboard-410c
- qemu_arm64
- environments: &environments_arm32
- x15
- qemu_arm
- environments: &environments_x86_64
- x86
- qemu_x86_64
- environments: &environments_i386
- i386
- qemu_i386
- environments: &environments_qemu
- qemu_arm
- qemu_arm64
- qemu_i386
- qemu_x86_64
- environments: &environments_32bit
- i386
- qemu_i386
- qemu_arm
- x15
- environments: &environments_qemu_arm
- qemu_arm
- qemu_arm64
- environments: &environments_intel
- i386
- qemu_i386
- qemu_x86_64
- x86
- environments: &environments_arm64_arm32
- dragonboard-410c
- hi6220-hikey
- juno-r2
- qemu_arm64
- qemu_arm
- x15
- environments: &environments_arm64_arm32_i386
- dragonboard-410c
- hi6220-hikey
- juno-r2
- qemu_arm64
- qemu_arm
- x15
- i386
- qemu_i386
projects:
- name: LKFT
projects: &projects_all
- lkft/linux-mainline-oe
- lkft/linux-stable-rc-4.20-oe
- lkft/linux-stable-rc-4.19-oe
- lkft/linux-stable-rc-4.14-oe
- lkft/linux-stable-rc-4.9-oe
- lkft/linux-stable-rc-4.4-oe
- lkft/linaro-hikey-stable-rc-4.4-oe
url: https://qa-reports.linaro.org
environments: &environments_all
- dragonboard-410c
- hi6220-hikey
- i386
- juno-r2
- qemu_x86_64
- qemu_i386
- qemu_arm
- qemu_arm64
- x15
- x86
known_issues:
- environments: *environments_all
notes: >
LKFT: kselftest: test_progs: libbpf: failed to open ./test_pkt_access.o:
No such file or directory
projects: *projects_all
test_names:
- kselftest/bpf_test_progs
- kselftest-vsyscall-mode-none/bpf_test_progs
- kselftest-vsyscall-mode-native/bpf_test_progs
url: https://bugs.linaro.org/show_bug.cgi?id=3120
active: true
intermittent: false
- environments: *environments_all
notes: >
LKFT: linux-next: x86: kselftest: test_kmod.sh test failed
projects: *projects_all
test_name: kselftest/bpf_test_kmod.sh
url: https://bugs.linaro.org/show_bug.cgi?id=3219
active: true
intermittent: false
- environments: *environments_all
notes: >
LKFT: linux-next: x86: kselftest: pstore_tests failed
projects: *projects_all
test_names:
- kselftest/pstore_pstore_tests
- kselftest-vsyscall-mode-none/pstore_pstore_tests
- kselftest-vsyscall-mode-native/pstore_pstore_tests
url: https://bugs.linaro.org/show_bug.cgi?id=3222
active: true
intermittent: false
- environments: *environments_all
notes: >
LKFT: linux-stable: linux-4.4.y: pstore_post_reboot_tests failed on
Hikey and x86
projects: *projects_all
test_names:
- kselftest/pstore_pstore_post_reboot_tests
url: https://bugs.linaro.org/show_bug.cgi?id=3222
active: true
intermittent: false
- environments: *environments_all
notes: >
LKFT: selftests: seccomp TRACE_syscall.skip_after_RET_TRACE
projects: *projects_all
test_names:
- kselftest/seccomp_seccomp_bpf
- kselftest-vsyscall-mode-none/seccomp_seccomp_bpf
- kselftest-vsyscall-mode-native/seccomp_seccomp_bpf
url: https://bugs.linaro.org/show_bug.cgi?id=2980
active: true
intermittent: false
- environments: *environments_arm64
notes: >
LKFT: linux-next: kselftest: breakpoint_test_arm64 build failed
projects: *projects_all
test_name: kselftest/breakpoint_test_arm64
url: https://bugs.linaro.org/show_bug.cgi?id=3208
active: true
intermittent: false
- environments: *environments_all
notes: >
LKFT: linux-mainline: kselftest sync_test failed
projects: *projects_all
test_name: kselftest/sync_sync_test
url: https://bugs.linaro.org/show_bug.cgi?id=3504
active: true
intermittent: false
- environments: *environments_all
notes: >
LKFT: kselftest BPF test_dev_cgroup failed on 4.14 and below
on all devices
projects:
- lkft/linux-stable-rc-4.14-oe
- lkft/linux-stable-rc-4.9-oe
- lkft/linux-stable-rc-4.4-oe
- lkft/linaro-hikey-stable-rc-4.4-oe
test_names:
- kselftest/bpf_test_dev_cgroup
- kselftest-vsyscall-mode-none/bpf_test_dev_cgroup
- kselftest-vsyscall-mode-native/bpf_test_dev_cgroup
url: https://bugs.linaro.org/show_bug.cgi?id=3500
active: true
intermittent: false
- environments: *environments_all
notes: >
Adding skiplist according to the below ticket mainline kernel tests baselining
projects: *projects_all
url: https://projects.linaro.org/projects/CTT/queues/issue/CTT-585
active: true
intermittent: false
test_names:
- kselftest/bpf_test_maps
- kselftest-vsyscall-mode-none/bpf_test_maps
- kselftest-vsyscall-mode-native/bpf_test_maps
- kselftest/bpf_test_tag
- kselftest-vsyscall-mode-none/bpf_test_tag
- kselftest-vsyscall-mode-native/bpf_test_tag
- kselftest/bpf_test_lru_map
- kselftest-vsyscall-mode-none/bpf_test_lru_map
- kselftest-vsyscall-mode-native/bpf_test_lru_map
- kselftest/bpf_test_lpm_map
- kselftest-vsyscall-mode-none/bpf_test_lpm_map
- kselftest-vsyscall-mode-native/bpf_test_lpm_map
- kselftest/futex_run.sh
- kselftest/intel_pstate_run.sh
- kselftest/android_run.sh
- kselftest/memfd_run_fuse_test.sh
- kselftest/vm_run_vmtests
- kselftest-vsyscall-mode-none/vm_run_vmtests
- kselftest-vsyscall-mode-native/vm_run_vmtests
- environments:
- x86
notes: >
kselftest mpx-mini-test_64 - no MPX support-failed-Aborted (core dumped)
projects: *projects_all
test_names:
- kselftest/x86_mpx-mini-test_64
- kselftest-vsyscall-mode-none/x86_mpx-mini-test_64
- kselftest-vsyscall-mode-native/x86_mpx-mini-test_64
url: https://bugs.linaro.org/show_bug.cgi?id=3497
active: true
intermittent: false
- environments:
- i386
notes: >
kselftest mpx-mini-test_32 - no MPX support-failed-Aborted (core dumped)
projects: *projects_all
test_name: kselftest/x86_mpx-mini-test_32
url: https://bugs.linaro.org/show_bug.cgi?id=3497
active: true
intermittent: false
- environments: *environments_i386
notes: >
kselftest: size: get_size Segmentation fault on i386
projects: *projects_all
test_name: kselftest/size_get_size
url: https://bugs.linaro.org/show_bug.cgi?id=3992
active: true
intermittent: false
- test_names:
- kselftest/firmware_fw_run_tests.sh
- kselftest-vsyscall-mode-none/firmware_fw_run_tests.sh
- kselftest-vsyscall-mode-native/firmware_fw_run_tests.sh
- kselftest/firmware_fw_fallback.sh
notes: >
LKFT: linux-mainline: x86, x15, juno-r2: kselftest fw_filesystem.sh failed
url: https://bugs.linaro.org/show_bug.cgi?id=3503
active: true
intermittent: false
matrix_apply:
- environments:
- dragonboard-410c
- juno-r2
- qemu_arm
- x15
- x86
- qemu_x86_64
- i386
- qemu_i386
projects: *projects_all
- environments: *environments_all
projects:
- lkft/linux-stable-rc-4.9-oe
- lkft/linux-stable-rc-4.4-oe
- lkft/linaro-hikey-stable-rc-4.4-oe
- environments: *environments_x86_64
notes: >
LKFT: mainline: x86: kselftests fsgsbase_64 failed - GS/BASE changed from
0x1/0x0 to 0x0/0x0 Fails intermittently
projects: *projects_all
test_names:
- kselftest/x86_fsgsbase_64
- kselftest-vsyscall-mode-none/x86_fsgsbase_64
- kselftest-vsyscall-mode-native/x86_fsgsbase_64
url: https://bugs.linaro.org/show_bug.cgi?id=3596
active: true
intermittent: true
- test_names:
- kselftest/net_reuseport_bpf_numa
- kselftest-vsyscall-mode-none/net_reuseport_bpf_numa
- kselftest-vsyscall-mode-native/net_reuseport_bpf_numa
notes: >
LKFT: linux-mainline: x15: kselfteest NET reuseport_bpf_numa failed
url: https://bugs.linaro.org/show_bug.cgi?id=3501
active: true
intermittent: true
matrix_apply:
- environments: *environments_all
projects:
- lkft/linux-stable-rc-4.9-oe
- lkft/linux-stable-rc-4.4-oe
- lkft/linaro-hikey-stable-rc-4.4-oe
- environments: *environments_arm32
projects: *projects_all
- environments:
- x86
projects:
- lkft/linux-mainline-oe
- test_names:
- kselftest/bpf_test_align
- kselftest-vsyscall-mode-none/bpf_test_align
- kselftest-vsyscall-mode-native/bpf_test_align
- kselftest/bpf_test_verifier
- kselftest-vsyscall-mode-none/bpf_test_verifier
- kselftest-vsyscall-mode-native/bpf_test_verifier
notes: >
LKFT: linux-next, 4.9 and 4.4: bpf: test_align and test_verifier:
No such file or directory
url: https://bugs.linaro.org/show_bug.cgi?id=3170
active: true
intermittent: false
matrix_apply:
- environments: *environments_all
projects:
- lkft/linux-stable-rc-4.20-oe
- lkft/linux-stable-rc-4.19-oe
- lkft/linux-stable-rc-4.14-oe
- lkft/linux-stable-rc-4.9-oe
- lkft/linux-stable-rc-4.4-oe
- lkft/linaro-hikey-stable-rc-4.4-oe
- environments: *environments_32bit
projects: *projects_all
- test_name: kselftest/lib_bitmap.sh
notes: >
LKFT: linux-mainline: x15: printf.sh bitmap.sh netns_netlink - section 4
reloc 2 sym memset relocation 28 out of range (0xbf046044 -> 0xc109f720)
url: https://bugs.linaro.org/show_bug.cgi?id=3484
active: true
intermittent: false
matrix_apply:
- environments: *environments_all
projects:
- lkft/linux-stable-rc-4.4-oe
- lkft/linaro-hikey-stable-rc-4.4-oe
- environments: *environments_arm32
projects:
- lkft/linux-stable-rc-4.20-oe
- lkft/linux-stable-rc-4.19-oe
- environments: *environments_all
notes: >
skip all tests memory hotplug is not supported
projects:
- lkft/linux-stable-rc-4.9-oe
- lkft/linux-stable-rc-4.4-oe
- lkft/linaro-hikey-stable-rc-4.4-oe
test_names:
- kselftest/memory-hotplug_mem-on-off-test.sh
url: null
active: true
intermittent: false
- test_name: kselftest/efivarfs_efivarfs.sh
notes: >
skip all tests efivarfs is not mounted on /sys/firmware/efi/efivars
url: null
active: true
intermittent: false
matrix_apply:
- environments: *environments_all
projects:
- lkft/linux-stable-rc-4.9-oe
- environments:
- dragonboard-410c
- hi6220-hikey
projects:
- lkft/linux-stable-rc-4.4-oe
- lkft/linaro-hikey-stable-rc-4.4-oe
- environments: *environments_all
notes: >
LKFT: 4.9-rc: Hikey: sysctl.sh need CONFIG_TEST_SYSCTL=y
projects:
- lkft/linux-stable-rc-4.9-oe
- lkft/linux-stable-rc-4.4-oe
- lkft/linaro-hikey-stable-rc-4.4-oe
test_name: kselftest/sysctl_sysctl.sh
url: https://bugs.linaro.org/show_bug.cgi?id=3251
active: true
intermittent: false
- environments:
- hi6220-hikey
- dragonboard-410c
notes: >
LKFT: timer: inconsistency-check failed on Hikey
projects:
- lkft/linux-stable-rc-4.9-oe
- lkft/linux-stable-rc-4.4-oe
- lkft/linaro-hikey-stable-rc-4.4-oe
test_name: kselftest/timer_inconsistency-check
url: https://bugs.linaro.org/show_bug.cgi?id=2950
active: true
intermittent: false
- environments: *environments_i386
notes: >
kselftests: x86_syscall_nt_32 fails on i386 and qemu_i386 for 4.4
projects:
- lkft/linux-stable-rc-4.4-oe
test_name: kselftest/x86_test_mremap_vdso_32
url: https://bugs.linaro.org/show_bug.cgi?id=4047
active: true
intermittent: false
- environments: *environments_i386
notes: >
kselftests: x86_syscall_nt_32 fails on i386 and qemu_i386 for 4.4
projects:
- lkft/linux-stable-rc-4.4-oe
test_name: kselftest/x86_syscall_nt_32
url: https://bugs.linaro.org/show_bug.cgi?id=4046
active: true
intermittent: false
- environments: *environments_i386
notes: >
kselftests: ldt_gdt_32 fails on i386 and qemu_i386
projects:
- lkft/linux-stable-rc-4.9-oe
- lkft/linux-stable-rc-4.4-oe
test_name: kselftest/x86_ldt_gdt_32
url: https://bugs.linaro.org/show_bug.cgi?id=3993
active: true
intermittent: false
- environments: *environments_x86_64
notes: >
kselftests: ldt_gdt_64 fails on x86
projects:
- lkft/linux-stable-rc-4.9-oe
- lkft/linux-stable-rc-4.4-oe
test_name: kselftest/x86_ldt_gdt_64
url: https://bugs.linaro.org/show_bug.cgi?id=3564
active: true
intermittent: false
- environments:
- dragonboard-410c
- i386
- juno-r2
- qemu_arm
- qemu_arm64
- qemu_i386
- qemu_x86_64
notes: >
LKFT: linux-stable-rc-4.4: Juno: kselftest cpufreq test failed - No cpu
is managed by cpufreq core, exiting
projects: *projects_all
test_names:
- kselftest/cpufreq_main.sh
url: https://bugs.linaro.org/show_bug.cgi?id=3489
active: true
intermittent: false
- environments: *environments_all
notes: >
LKFT: nsfs: owner and pidns failed - main:57:Unable to open
/proc/2829/ns/uts: No such file or director
projects:
- lkft/linux-stable-rc-4.4-oe
- lkft/linaro-hikey-stable-rc-4.4-oe
test_names:
- kselftest/nsfs_owner
- kselftest/nsfs_pidns
url: https://bugs.linaro.org/show_bug.cgi?id=3090
active: true
intermittent: false
- environments: *environments_all
notes: null
projects:
- lkft/linux-stable-rc-4.4-oe
- lkft/linaro-hikey-stable-rc-4.4-oe
test_name: kselftest/net_run_afpackettests
url: null
active: true
intermittent: false
- environments: *environments_all
notes: null
projects:
- lkft/linux-stable-rc-4.4-oe
- lkft/linaro-hikey-stable-rc-4.4-oe
test_name: kselftest/sigaltstack_sas
url: null
active: true
intermittent: false
- test_name: kselftest/rtc_rtctest
notes: >
LKFT: linux-mainline, 4.9 and 4.4: x15: rtctest - PIE delta error: 0.018197
should be close to 0.015625
url: https://bugs.linaro.org/show_bug.cgi?id=3402
active: true
intermittent: false
matrix_apply:
- environments:
- hi6220-hikey
projects:
- lkft/linaro-hikey-stable-rc-4.4-oe
- environments: *environments_qemu
projects: *projects_all
- environments:
- dragonboard-410c
- x15
projects: *projects_all
- environments:
- dragonboard-410c
- x15
- qemu_x86_64
- qemu_arm64
- qemu_arm
- qemu_i386
notes: >
LKFT: linux-mainline, 4.9 and 4.4: x15: rtcpie - PIE delta error: 0.018197
should be close to 0.015625
projects: *projects_all
test_names:
- kselftest/timers_rtcpie
url: https://bugs.linaro.org/show_bug.cgi?id=3402
active: true
intermittent: true
- test_name: kselftest/net_test_bpf.sh
notes: null
url: null
active: true
intermittent: false
matrix_apply:
- environments:
- dragonboard-410c
- hi6220-hikey
projects:
- lkft/linux-stable-rc-4.4-oe
- lkft/linaro-hikey-stable-rc-4.4-oe
- environments: *environments_qemu
notes: null
projects: *projects_all
test_name: kselftest/breakpoint_test
url: null
active: true
intermittent: false
- environments: *environments_qemu_arm
notes: null
projects: *projects_all
test_name: kselftest/mq_open_tests
url: null
active: true
intermittent: false
- environments: *environments_qemu_arm
notes: null
projects: *projects_all
test_name: kselftest/mq_perf_tests
url: null
active: true
intermittent: false
- environments: *environments_all
notes: >
LKFT: BPF: test_tcpbpf_user test_libbpf.sh failed - test_tcpbpf_kern.o open
test_l4lb.o : No such file or directory
projects: *projects_all
test_names:
- kselftest/bpf_test_libbpf.sh
- kselftest-vsyscall-mode-none/bpf_test_libbpf.sh
- kselftest-vsyscall-mode-native/bpf_test_libbpf.sh
- kselftest/bpf_test_offload.py
- kselftest/bpf_test_tcpbpf_user
- kselftest-vsyscall-mode-none/bpf_test_tcpbpf_user
- kselftest-vsyscall-mode-native/bpf_test_tcpbpf_user
url: https://bugs.linaro.org/show_bug.cgi?id=3636
active: true
intermittent: false
- environments: *environments_qemu
notes: null
projects: *projects_all
test_name: kselftest/static_keys_test_static_keys.sh
url: null
active: true
intermittent: false
- environments: *environments_qemu
notes: null
projects: *projects_all
test_name: kselftest/user_test_user_copy.sh
url: null
active: true
intermittent: false
- test_name: kselftest/x86_sigreturn_64
notes: >
LKFT: kselftest: sigreturn_64 intermittent failure on qemu_x86_64
url: https://bugs.linaro.org/show_bug.cgi?id=3684
active: true
intermittent: true
matrix_apply:
- environments:
- qemu_x86_64
projects: *projects_all
- environments: *environments_x86_64
projects:
- lkft/linux-stable-rc-4.4-oe
- environments: *environments_all
notes: >
LKFT: linux-mainline: all: net fib-onlink-tests.sh and fib_tests.sh failed
projects: *projects_all
test_names:
- kselftest/net_fib-onlink-tests.sh
- kselftest-vsyscall-mode-none/net_fib-onlink-tests.sh
- kselftest-vsyscall-mode-native/net_fib-onlink-tests.sh
- kselftest/net_fib_tests.sh
- kselftest-vsyscall-mode-none/net_fib_tests.sh
- kselftest-vsyscall-mode-native/net_fib_tests.sh
url: https://bugs.linaro.org/show_bug.cgi?id=3742
active: true
intermittent: false
- test_names:
- kselftest/gpio_gpio-mockup.sh
notes: >
LKFT: linux-next: gpio: gpio-mockup-chardev: No such file or directory -
Build failed.
url: https://bugs.linaro.org/show_bug.cgi?id=3122
active: true
intermittent: false
matrix_apply:
- environments: *environments_arm32
projects:
- lkft/linux-stable-rc-4.20-oe
- lkft/linux-stable-rc-4.19-oe
- environments: *environments_all
projects:
- lkft/linux-stable-rc-4.14-oe
- lkft/linux-stable-rc-4.9-oe
- lkft/linux-stable-rc-4.4-oe
- lkft/linaro-hikey-stable-rc-4.4-oe
- environments: *environments_all
notes: >
LKFT: LKFT: 4.14 4.9 4.4 : membarrier_test test failed on all devices when
kselftest upgrade to 4.16
projects:
- lkft/linux-stable-rc-4.14-oe
- lkft/linux-stable-rc-4.9-oe
- lkft/linux-stable-rc-4.4-oe
- lkft/linaro-hikey-stable-rc-4.4-oe
test_names:
- kselftest/membarrier_membarrier_test
- kselftest-vsyscall-mode-none/membarrier_membarrier_test
- kselftest-vsyscall-mode-native/membarrier_membarrier_test
url: https://bugs.linaro.org/show_bug.cgi?id=3771
active: true
intermittent: false
- environments:
- dragonboard-410c
- hi6220-hikey
- juno-r2
- x86
- qemu_x86_64
notes: >
LKFT: LKFT: mainline: dragon board 410c: proc read failed - ICMPv6: process
read is using deprecated sysctl
projects: *projects_all
test_name: kselftest/proc_read
url: https://bugs.linaro.org/show_bug.cgi?id=3744
active: true
intermittent: true
- environments: *environments_all
notes: >
LKFT: LTP: netns_sysfs and kselftests rtnetlink.sh 1 TBROK: failed to add
a new (host) dummy device on Hikey and Juno
projects: *projects_all
test_names:
- kselftest/net_rtnetlink.sh
- kselftest-vsyscall-mode-none/net_rtnetlink.sh
- kselftest-vsyscall-mode-native/net_rtnetlink.sh
url: https://bugs.linaro.org/show_bug.cgi?id=3834
active: true
intermittent: false
- environments: *environments_all
notes: >
LKFT: linux-mainline: devpts_pts failed on all devices Failed to perform
TIOCGPTPEER ioctl
projects: *projects_all
test_name: kselftest/filesystems_devpts_pts
url: https://bugs.linaro.org/show_bug.cgi?id=3732
active: true
intermittent: false
- test_names:
- kselftest/proc_proc-self-map-files-002
- kselftest-vsyscall-mode-none/proc_proc-self-map-files-002
- kselftest-vsyscall-mode-native/proc_proc-self-map-files-002
notes: >
LKFT: all-dev: kselftest proc selftests: proc-self-map-files-002 failed
on 4.16 to 4.4 kernels.
url: https://bugs.linaro.org/show_bug.cgi?id=3782
active: true
intermittent: false
matrix_apply:
- environments: *environments_all
projects:
- lkft/linaro-hikey-stable-rc-4.4-oe
- lkft/linux-stable-rc-4.4-oe
- lkft/linux-stable-rc-4.9-oe
- lkft/linux-stable-rc-4.14-oe
- environments: *environments_arm32
projects: *projects_all
- environments: *environments_all
notes: >
LKFT: kselftest: proc-self-map-files-001 not made for ARM
proc-self-map-files-002 is the same test and works for ARM.
projects:
- lkft/linaro-hikey-stable-rc-4.4-oe
- lkft/linux-stable-rc-4.4-oe
- lkft/linux-stable-rc-4.9-oe
- lkft/linux-stable-rc-4.14-oe
test_names:
- kselftest/proc_proc-self-map-files-001
- kselftest-vsyscall-mode-none/proc_proc-self-map-files-001
- kselftest-vsyscall-mode-native/proc_proc-self-map-files-001
url: https://bugs.linaro.org/show_bug.cgi?id=3908
active: true
intermittent: false
- environments: *environments_arm32
notes: >
LKFT: mainline: kselftest proc selftests: proc-self-syscall failed on arm32
projects: *projects_all
test_name: kselftest/proc_proc-self-syscall
url: https://bugs.linaro.org/show_bug.cgi?id=3783
active: true
intermittent: false
- environments: *environments_all
notes: >
LKFT: 4.4: Juno: Hikey: x15: x86 reuseport_bpf reuseport_bpf_cpu failed
projects:
- lkft/linux-stable-rc-4.4-oe
- lkft/linaro-hikey-stable-rc-4.4-oe
test_names:
- kselftest/net_reuseport_bpf
- kselftest/net_reuseport_bpf_cpu
url: https://bugs.linaro.org/show_bug.cgi?id=3520
active: true
intermittent: false
- environments: *environments_arm64_arm32_i386
notes: >
LKFT: mainline: hikey: kvm ./set_sregs_test: No such file or directory
KVM test cases do not build for arm/arm64 and i386.
projects: *projects_all
test_names:
- kselftest/kvm_set_sregs_test
- kselftest/kvm_sync_regs_test
- kselftest/kvm_vmx_tsc_adjust_test
- kselftest/kvm_cr4_cpuid_sync_test
- kselftest/kvm_state_test
- kselftest/kvm_dirty_log_test
- kselftest/kvm_clear_dirty_log_test
- kselftest/kvm_hyperv_cpuid
- kselftest/kvm_platform_info_test
- kselftest/kvm_evmcs_test
url: https://bugs.linaro.org/show_bug.cgi?id=3741
active: true
intermittent: false
- environments: *environments_all
notes: >
LKFT: kselftest: test_progs: libbpf: failed to open ./test_pkt_access.o:
No such file or directory
projects: *projects_all
test_names:
- kselftest/bpf_test_sock_addr.sh
- kselftest-vsyscall-mode-none/bpf_test_sock_addr.sh
- kselftest-vsyscall-mode-native/bpf_test_sock_addr.sh
- kselftest/bpf_test_sock
- kselftest-vsyscall-mode-none/bpf_test_sock
- kselftest-vsyscall-mode-native/bpf_test_sock
url: https://bugs.linaro.org/show_bug.cgi?id=3912
active: true
intermittent: true
- environments: *environments_all
notes: >
LKFT: net: pmtu.sh: vti4 and vti6 not supported - RTNETLINK answers: Operation
not supported
projects: *projects_all
test_names:
- kselftest/net_pmtu.sh
- kselftest-vsyscall-mode-none/net_pmtu.sh
- kselftest-vsyscall-mode-native/net_pmtu.sh
url: https://bugs.linaro.org/show_bug.cgi?id=3830
active: true
intermittent: true
- environments: *environments_all
notes: >
LKFT: bpf: get_cgroup_id_user failed errno 2 on all devices
This expected file not found,
/sys/kernel/debug/tracing/events/syscalls/sys_enter_nanosleep/id
projects: *projects_all
test_names:
- kselftest/bpf_get_cgroup_id_user
- kselftest-vsyscall-mode-none/bpf_get_cgroup_id_user
- kselftest-vsyscall-mode-native/bpf_get_cgroup_id_user
url: https://bugs.linaro.org/show_bug.cgi?id=3920
active: true
intermittent: false
- environments: *environments_all
notes: >
test_lirc_mode2_user failed on all devices
Test should be called from a script file with a required parameter.
Need a Makefile fix for this case
projects: *projects_all
test_names:
- kselftest/bpf_test_lirc_mode2_user
- kselftest-vsyscall-mode-none/bpf_test_lirc_mode2_user
- kselftest-vsyscall-mode-native/bpf_test_lirc_mode2_user
url: https://bugs.linaro.org/show_bug.cgi?id=3918
active: true
intermittent: false
- environments: *environments_all
notes: >
LKFT: bpf: test_lwt_seg6local.sh CONFIG_LWTUNNEL is not enabled in this kernel
When enable CONFIG_LWTUNNEL=y
./test_lwt_seg6local.sh
Program section 'encap_srh' not found in ELF file!
Error fetching program/map!
Failed to parse eBPF program: Operation not permitted
projects: *projects_all
test_names:
- kselftest/bpf_test_lwt_seg6local.sh
- kselftest-vsyscall-mode-none/bpf_test_lwt_seg6local.sh
- kselftest-vsyscall-mode-native/bpf_test_lwt_seg6local.sh
url: https://bugs.linaro.org/show_bug.cgi?id=3919
active: true
intermittent: false
- environments: *environments_all
notes: >
test_select_reuseport failed on all devices.
prepare_bpf_obj(100):FAIL:get first bpf_program !prog
Error fetching program/map!
projects: *projects_all
test_names:
- kselftest/bpf_test_select_reuseport
- kselftest-vsyscall-mode-none/bpf_test_select_reuseport
- kselftest-vsyscall-mode-native/bpf_test_select_reuseport
url: https://bugs.linaro.org/show_bug.cgi?id=3974
active: true
intermittent: false
- test_names:
- kselftest/bpf_test_skb_cgroup_id.sh
- kselftest-vsyscall-mode-none/bpf_test_skb_cgroup_id.sh
- kselftest-vsyscall-mode-native/bpf_test_skb_cgroup_id.sh
notes: >
bpf: test_skb_cgroup_id.sh Error fetching program/map
FAILs on 4.19, 4.18, 4.14, 4.9 and 4.4 kernels on all devices.
PASS on mainline and next for arm64, arm and i386.
FAILs on x86_64 and qemu_x86_64 for all kernel branches.
url: https://bugs.linaro.org/show_bug.cgi?id=3975
active: true
intermittent: true
matrix_apply:
- environments: *environments_x86_64
projects: *projects_all
- environments: *environments_all
projects:
- lkft/linux-stable-rc-4.20-oe
- lkft/linux-stable-rc-4.19-oe
- lkft/linux-stable-rc-4.14-oe
- lkft/linux-stable-rc-4.9-oe
- lkft/linux-stable-rc-4.4-oe
- lkft/linaro-hikey-stable-rc-4.4-oe
- test_names:
- kselftest/bpf_test_socket_cookie
- kselftest-vsyscall-mode-none/bpf_test_socket_cookie
- kselftest-vsyscall-mode-native/bpf_test_socket_cookie
matrix_apply:
- environments: *environments_32bit
projects: *projects_all
- environments: *environments_all
projects:
- lkft/linux-stable-rc-4.20-oe
- lkft/linux-stable-rc-4.19-oe
- lkft/linux-stable-rc-4.14-oe
- lkft/linux-stable-rc-4.9-oe
- lkft/linux-stable-rc-4.4-oe
- lkft/linaro-hikey-stable-rc-4.4-oe
notes: >
bpf: test_socket_cookie failed on x86_64 and arm32
libbpf: ./socket_cookie_prog.o doesn't provide kernel version
(test_socket_cookie.c:154: errno: No such file or directory) Failed to load ./socket_cookie_prog.o
url: https://bugs.linaro.org/show_bug.cgi?id=3976
active: true
intermittent: true
- environments: *environments_all
notes: >
BPF test_sockmap failed on all devices.
libbpf: test_sockmap_kern.o doesn't provide kernel version
ERROR: (-1) load bpf failed
Unable to load eBPF objects in file 'test_sockmap_kern.o' : 'version' section incorrect or lost
projects: *projects_all
test_names:
- kselftest/bpf_test_sockmap
- kselftest-vsyscall-mode-none/bpf_test_sockmap
- kselftest-vsyscall-mode-native/bpf_test_sockmap
url: https://bugs.linaro.org/show_bug.cgi?id=3977
active: true
intermittent: true
- environments: *environments_all
notes: >
LKFT: cgroup: test_core: test_cgcore_internal_process_constraint
not ok 1 test_cgcore_internal_process_constraint
ok 2 test_cgcore_top_down_constraint_enable
not ok 3 test_cgcore_top_down_constraint_disable
projects: *projects_all
test_names:
- kselftest/cgroup_test_core
- kselftest-vsyscall-mode-none/cgroup_test_core
- kselftest-vsyscall-mode-native/cgroup_test_core
url: https://bugs.linaro.org/show_bug.cgi?id=3981
active: true
intermittent: false
- test_names:
- kselftest/net_msg_zerocopy.sh
- kselftest-vsyscall-mode-none/net_msg_zerocopy.sh
- kselftest-vsyscall-mode-native/net_msg_zerocopy.sh
notes: >
LKFT: net: msg_zerocopy.sh failed on x15 and qemu_arm on all kernels
and for all devices running 4.4 n 4.9 kernel
url: https://bugs.linaro.org/show_bug.cgi?id=3928
active: true
intermittent: false
matrix_apply:
- environments: *environments_arm32
projects: *projects_all
- environments: *environments_all
projects:
- lkft/linux-stable-rc-4.9-oe
- lkft/linux-stable-rc-4.4-oe
- lkft/linaro-hikey-stable-rc-4.4-oe
- test_names:
- kselftest/net_psock_snd.sh
- kselftest-vsyscall-mode-none/net_psock_snd.sh
- kselftest-vsyscall-mode-native/net_psock_snd.sh
notes: >
LKFT: net: psock_snd: recv: Resource temporarily unavailable on all devices
url: https://bugs.linaro.org/show_bug.cgi?id=3925
active: true
intermittent: false
environments: *environments_all
projects: *projects_all
- environments: *environments_all
notes: >
net: tls: tls.recv_peek_multiple_records failed on all devices and all kernel except next
projects: *projects_all
test_names:
- kselftest/net_tls
- kselftest-vsyscall-mode-none/net_tls
- kselftest-vsyscall-mode-native/net_tls
url: https://bugs.linaro.org/show_bug.cgi?id=3925
active: false
intermittent: false
- test_names:
- kselftest/rseq_basic_percpu_ops_test
- kselftest-vsyscall-mode-none/rseq_basic_percpu_ops_test
- kselftest-vsyscall-mode-native/rseq_basic_percpu_ops_test
notes: >
LKFT: Kselftest: rseq: tests not building for arm64 for mainline but test pass on -next
url: https://bugs.linaro.org/show_bug.cgi?id=3923
active: true
intermittent: false
matrix_apply:
- environments: *environments_arm64
projects: *projects_all
- environments: *environments_all
projects:
- lkft/linux-stable-rc-4.14-oe
- lkft/linux-stable-rc-4.9-oe
- lkft/linux-stable-rc-4.4-oe
- lkft/linaro-hikey-stable-rc-4.4-oe
- test_names:
- kselftest/rseq_param_test
- kselftest-vsyscall-mode-none/rseq_param_test
- kselftest-vsyscall-mode-native/rseq_param_test
- kselftest/rseq_param_test_benchmark
- kselftest-vsyscall-mode-none/rseq_param_test_benchmark
- kselftest-vsyscall-mode-native/rseq_param_test_benchmark
- kselftest/rseq_param_test_compare_twice
- kselftest-vsyscall-mode-none/rseq_param_test_compare_twice
- kselftest-vsyscall-mode-native/rseq_param_test_compare_twice
- kselftest/rseq_basic_test
- kselftest-vsyscall-mode-none/rseq_basic_test
- kselftest-vsyscall-mode-native/rseq_basic_test
- kselftest/rseq_run_param_test.sh
- kselftest-vsyscall-mode-none/rseq_run_param_test.sh
- kselftest-vsyscall-mode-native/rseq_run_param_test.sh
notes: >
LKFT: Kselftest: rseq: tests not building for arm64 for mainline but test pass on -next
LKFT: Kselftest: rseq: : Function not implemented on older kernel
url: https://bugs.linaro.org/show_bug.cgi?id=3923
active: true
intermittent: false
matrix_apply:
- environments: *environments_arm64
projects: *projects_all
- environments: *environments_all
projects:
- lkft/linux-stable-rc-4.14-oe
- lkft/linux-stable-rc-4.9-oe
- lkft/linux-stable-rc-4.4-oe
- lkft/linaro-hikey-stable-rc-4.4-oe
- environments: *environments_all
notes: >
selftests: proc: fd-003-kthread test_lookup_fail: Assertion
on 4.4 and 4.9 for all devices
statx syscall isn't available in kernels 4.4 and 4.9 according to strace
and ENOSYS. And it is likely that it won't be added to v4.4 and v4.9.
This test should continue be marked as known issue for those kernels.
projects:
- lkft/linux-stable-rc-4.9-oe
- lkft/linux-stable-rc-4.4-oe
- lkft/linaro-hikey-stable-rc-4.4-oe
test_names:
- kselftest/proc_fd-003-kthread
- kselftest-vsyscall-mode-none/proc_fd-003-kthread
- kselftest-vsyscall-mode-native/proc_fd-003-kthread
url: https://bugs.linaro.org/show_bug.cgi?id=4039
active: true
intermittent: false
- environments:
- qemu_i386
notes: >
x86: syscall_arg_fault_32 intermittent failure on qemu_i386
projects: *projects_all
test_name: kselftest/x86_syscall_arg_fault_32
url: https://bugs.linaro.org/show_bug.cgi?id=4025
active: true
intermittent: true
- environments: *environments_all
notes: >
LKFT: BPF test_btf PASS on 4.18 and failed on 4.17 and below
projects:
- lkft/linux-stable-rc-4.19-oe
- lkft/linux-stable-rc-4.14-oe
- lkft/linux-stable-rc-4.9-oe
- lkft/linux-stable-rc-4.4-oe
- lkft/linaro-hikey-stable-rc-4.4-oe
test_names:
- kselftest/bpf_test_btf
- kselftest-vsyscall-mode-native/bpf_test_btf
- kselftest-vsyscall-mode-none/bpf_test_btf
url: https://bugs.linaro.org/show_bug.cgi?id=3979
active: true
intermittent: false
- environments: *environments_all
notes: >
LKFT: net: udpgso.sh PASS on 4.18 and failed on 4.17 and below
projects:
- lkft/linux-stable-rc-4.14-oe
- lkft/linux-stable-rc-4.9-oe
- lkft/linux-stable-rc-4.4-oe
- lkft/linaro-hikey-stable-rc-4.4-oe
test_names:
- kselftest/net_udpgso.sh
- kselftest-vsyscall-mode-none/net_udpgso.sh
- kselftest-vsyscall-mode-native/net_udpgso.sh
url: https://bugs.linaro.org/show_bug.cgi?id=3980
active: true
intermittent: false
- environments: *environments_all
notes: >
LKFT: selftests: bpf: test_cgroup_storage Failed to create map: Invalid argument
PASS on 4.20 mainline and -next.
FAILED on 4.19, 4.14, 4.9 and 4.4 on all devices.
projects:
- lkft/linux-stable-rc-4.19-oe
- lkft/linux-stable-rc-4.14-oe
- lkft/linux-stable-rc-4.9-oe
- lkft/linux-stable-rc-4.4-oe
- lkft/linaro-hikey-stable-rc-4.4-oe
test_names:
- kselftest/bpf_test_cgroup_storage
- kselftest-vsyscall-mode-none/bpf_test_cgroup_storage
- kselftest-vsyscall-mode-native/bpf_test_cgroup_storage
url: https://bugs.linaro.org/show_bug.cgi?id=4050
active: true
intermittent: false
- environments: *environments_all
notes: >
LKFT: selftests: net: fib_rule_tests.sh RTNETLINK answers: Operation not supported 4.14 and below
PASS on 4.18, 4.19 mainline and -next.
FAILED on 4.14, 4.9 and 4.4 on all devices.
projects:
- lkft/linux-stable-rc-4.14-oe
- lkft/linux-stable-rc-4.9-oe
- lkft/linux-stable-rc-4.4-oe
- lkft/linaro-hikey-stable-rc-4.4-oe
test_names:
- kselftest/net_fib_rule_tests.sh
- kselftest-vsyscall-mode-none/net_fib_rule_tests.sh
- kselftest-vsyscall-mode-native/net_fib_rule_tests.sh
url: https://bugs.linaro.org/show_bug.cgi?id=4051
active: true
intermittent: false
- environments:
- x86
notes: >
LKFT: 4.9 and 4.4: x86: breakpoint step_after_suspend_tests
Bail out! Failed to enter Suspend state
projects:
- lkft/linux-stable-rc-4.9-oe
- lkft/linux-stable-rc-4.4-oe
test_names:
- kselftest/breakpoints_step_after_suspend_test
- kselftest-vsyscall-mode-none/breakpoints_step_after_suspend_test
- kselftest-vsyscall-mode-native/breakpoints_step_after_suspend_test
url: https://bugs.linaro.org/show_bug.cgi?id=3739
active: true
intermittent: false
- environments: *environments_all
notes: >
LKFT: bpf test_flow_dissector.sh libbpf: object file doesn't contain
bpf program failed on all devices
Here is the fix patch for this bug,
test_flow_dissector.sh depends on both with_addr.sh and with_tunnels.sh
However, we install only with_addr.sh.
Add with_tunnels.sh to TEST_PROGS_EXTENDED to make sure it gets
installed as well
projects: *projects_all
test_names:
- kselftest/bpf_test_flow_dissector.sh
- kselftest-vsyscall-mode-none/bpf_test_flow_dissector.sh
- kselftest-vsyscall-mode-native/bpf_test_flow_dissector.sh
url: https://bugs.linaro.org/show_bug.cgi?id=4036
active: true
intermittent: false
- test_names:
- kselftest/bpf_test_netcnt
- kselftest-vsyscall-mode-none/bpf_test_netcnt
- kselftest-vsyscall-mode-native/bpf_test_netcnt
notes: >
kselftest: i386: bpf: test_netcnt : libbpf: failed to create map
(name: 'percpu_netcnt'): Invalid argument
url: https://bugs.linaro.org/show_bug.cgi?id=4245
active: true
intermittent: false
matrix_apply:
- environments: *environments_i386
projects: *projects_all
- environments: *environments_all
projects:
- lkft/linux-stable-rc-4.19-oe
- lkft/linux-stable-rc-4.14-oe
- lkft/linux-stable-rc-4.9-oe
- lkft/linux-stable-rc-4.4-oe
- lkft/linaro-hikey-stable-rc-4.4-oe
- environments: *environments_all
notes: >
LKFT: selftests: net: test_vxlan_fdb_changelink.sh
expected two remotes after link set FAIL
FAILED on 4.18, 4.14, 4.9 and 4.4 on all devices.
projects:
- lkft/linux-stable-rc-4.19-oe
- lkft/linux-stable-rc-4.14-oe
- lkft/linux-stable-rc-4.9-oe
- lkft/linux-stable-rc-4.4-oe
- lkft/linaro-hikey-stable-rc-4.4-oe
test_names:
- kselftest/net_test_vxlan_fdb_changelink.sh
- kselftest-vsyscall-mode-none/net_test_vxlan_fdb_changelink.sh
- kselftest-vsyscall-mode-native/net_test_vxlan_fdb_changelink.sh
url: https://bugs.linaro.org/show_bug.cgi?id=4266
active: true
intermittent: false
- environments: *environments_all
notes: >
selftests/net/ip_defrag.sh : ./ip_defrag: recv: expected timeout; got 2272
FAILED on 4.20, 4.19, 4.14, 4.9 and 4.4 on all devices.
Fixed and PASS on mainline
projects:
- lkft/linux-stable-rc-4.20-oe
- lkft/linux-stable-rc-4.19-oe
- lkft/linux-stable-rc-4.14-oe
- lkft/linux-stable-rc-4.9-oe
- lkft/linux-stable-rc-4.4-oe
- lkft/linaro-hikey-stable-rc-4.4-oe
test_names:
- kselftest/net_ip_defrag.sh
- kselftest-vsyscall-mode-none/net_ip_defrag.sh
- kselftest-vsyscall-mode-native/net_ip_defrag.sh
url: https://bugs.linaro.org/show_bug.cgi?id=4214
active: true
intermittent: false
- environments: *environments_all
notes: >
LKFT: 4.14 4.4: BPF: test_xdp_redirect.sh and test_xdp_meta.sh skipped
Could not run test without the ip xdpgeneric support
FAILED on 4.14 and 4.4 on all devices.
PASS on 4.9, 4.19, 4.20 mainline and -next
projects:
- lkft/linux-stable-rc-4.14-oe
- lkft/linux-stable-rc-4.4-oe
- lkft/linaro-hikey-stable-rc-4.4-oe
test_names:
- kselftest/bpf_test_xdp_meta.sh
- kselftest-vsyscall-mode-none/bpf_test_xdp_meta.sh
- kselftest-vsyscall-mode-native/bpf_test_xdp_meta.sh
url: https://bugs.linaro.org/show_bug.cgi?id=3630
active: true
intermittent: false
- test_names:
- kselftest/bpf_test_xdp_vlan.sh
- kselftest-vsyscall-mode-none/bpf_test_xdp_vlan.sh
- kselftest-vsyscall-mode-native/bpf_test_xdp_vlan.sh
notes: >
selftest: bpf_test_xdp_vlan.sh ping fails
failed for all 32bit devices on all branches
failed on 4.14 and 4.4 on all devices.
matrix_apply:
- environments: *environments_32bit
projects: *projects_all
- environments: *environments_all
projects:
- lkft/linux-stable-rc-4.14-oe
- lkft/linux-stable-rc-4.4-oe
- lkft/linaro-hikey-stable-rc-4.4-oe
url: https://bugs.linaro.org/show_bug.cgi?id=4285
active: true
intermittent: false