Skip to content
This repository

HTTPS clone URL

Subversion checkout URL

You can clone with HTTPS or Subversion.

Download ZIP
branch: master
Fetching contributors…

Cannot retrieve contributors at this time

executable file 41 lines (31 sloc) 1.19 kb
1 2 3 4 5 6 7 8 9 10 11 12 13 14 15 16 17 18 19 20 21 22 23 24 25 26 27 28 29 30 31 32 33 34 35 36 37 38 39 40 41
#include "TestReporterStdout.h"
#include <cstdio>

#include "TestDetails.h"

namespace UnitTest {

void TestReporterStdout::ReportFailure(TestDetails const& details, char const* failure)
{
#if defined(__APPLE__) || defined(__GNUG__)
    char const* const errorFormat = "%s:%d: error: Failure in %s: %s\n";
#else
    char const* const errorFormat = "%s(%d): error: Failure in %s: %s\n";
#endif

using namespace std;
    printf(errorFormat, details.filename, details.lineNumber, details.testName, failure);
}

void TestReporterStdout::ReportTestStart(TestDetails const& /*test*/)
{
}

void TestReporterStdout::ReportTestFinish(TestDetails const& /*test*/, float)
{
}

void TestReporterStdout::ReportSummary(int const totalTestCount, int const failedTestCount,
                                       int const failureCount, float secondsElapsed)
{
using namespace std;

    if (failureCount > 0)
        printf("FAILURE: %d out of %d tests failed (%d failures).\n", failedTestCount, totalTestCount, failureCount);
    else
        printf("Success: %d tests passed.\n", totalTestCount);

    printf("Test time: %.2f seconds.\n", secondsElapsed);
}

}
Something went wrong with that request. Please try again.