{"text_format":"1","workbook":"xlsx","n_sheets":4,"sheets":["PDF Information","Wage and Name","Filtered Information","Payroll Sheet"],"not_rendered":{"charts":0,"images":3,"macros":1,"external_links":0,"defined_names":8,"comments":1,"pivot_tables":0},"unopened":[],"bounds":{"document_bytes":16777216,"sheet_cells":100000,"rows_first":2000,"rows_last":500,"rows_between":2000,"halvings":0,"cell_chars":16384,"cell_head_chars":4096},"cells_cut":0,"cells_raw":0,"read":"whole","date_system":"1900"}

{"sheet":"PDF Information","index":0,"n_rows":700,"n_cols":22,"rows_kept":700,"cut":false,"hidden":false,"merged":[[0,1,0,11],[1,1,1,11]]}
["Path to PDF File","D:\\D.Dropbox\\Dropbox\\Work\\0342.pdf"]
["Path to Shell Command","C:\\Program Files (x86)\\Adobe\\Reader 11.0\\Reader\\AcroRd32.exe"]
[]
[null,null,null,null,"Job_ID",{"$f":"IFERROR(INDEX((RIGHT($A$4:$A$560,LEN(INDEX($A$4:$A$560,MATCH(E4&\"*\",$A$4:$A$560,)))-LEN(E4)-1)),MATCH(E4&\"*\",$A$4:$A$560,)),\"\")","v":""},null,null,null,null,null,null,null,null,null,null,null,null,null,null,null,"Date Reference"]
[null,null,null,null,"Employer",{"$f":"IFERROR(INDEX((RIGHT($A$4:$A$560,LEN(INDEX($A$4:$A$560,MATCH(E5&\"*\",$A$4:$A$560,)))-LEN(E5)-1)),MATCH(E5&\"*\",$A$4:$A$560,)),\"\")","v":""},null,null,null,null,null,null,null,null,null,null,null,null,null,null,null,{"$f":"CONCATENATE(A5,\" \",B5,\" \",C5,\" \",D5)","v":"   "}]
[null,null,null,null,"Pay roll",{"$f":"IFERROR(INDEX((RIGHT($A$4:$A$560,LEN(INDEX($A$4:$A$560,MATCH(E6&\"*\",$A$4:$A$560,)))-LEN(E6)-1)),MATCH(E6&\"*\",$A$4:$A$560,)),\"\")","v":""},null,null,null,null,null,null,null,null,null,null,null,null,null,null,null,{"$f":"CONCATENATE(A6,\" \",B6,\" \",C6,\" \",D6)","v":"   "}]
[null,null,null,null,"RT Person",{"$f":"IFERROR(INDEX((RIGHT($A$4:$A$560,LEN(INDEX($A$4:$A$560,MATCH(E7&\"*\",$A$4:$A$560,)))-LEN(E7)-1)),MATCH(E7&\"*\",$A$4:$A$560,)),\"\")","v":""},null,null,null,null,null,null,null,null,null,null,null,null,null,null,null,"   "]
[null,null,null,null,"RT Location",{"$f":"IFERROR(INDEX((RIGHT($A$4:$A$560,LEN(INDEX($A$4:$A$560,MATCH(E8&\"*\",$A$4:$A$560,)))-LEN(E8)-1)),MATCH(E8&\"*\",$A$4:$A$560,)),\"\")","v":""},null," ",null,null,null,null,null,null,null,null,null,null,null,null,null,"   "]
[null,null,null,null,"Date"," Tuesday  October 28, 2013 ",null,null,null,null,null,null,null,null,null,null,null,null,null,null,null,"   "]
[null,null,null,null,"Pension",{"$f":"IFERROR(INDEX((RIGHT($A$4:$A$560,LEN(INDEX($A$4:$A$560,MATCH(E10&\"*\",$A$4:$A$560,)))-LEN(E10)-1)),MATCH(E10&\"*\",$A$4:$A$560,)),\"\")","v":""},null,null,null,null,null,null,null,null,null,null,null,null,null,null,null,"   "]
[null,null,null,null,"Health&Welfare",{"$f":"IFERROR(INDEX((RIGHT($A$4:$A$560,LEN(INDEX($A$4:$A$560,MATCH(E11&\"*\",$A$4:$A$560,)))-LEN(E11)-1)),MATCH(E11&\"*\",$A$4:$A$560,)),\"\")","v":""},null,null,null,null,null,null,null,null,null,null,null,null,null,null,null,"   "]
[null,null,null,null,"Training Trust",{"$f":"IFERROR(INDEX((RIGHT($A$4:$A$560,LEN(INDEX($A$4:$A$560,MATCH(E12&\"*\",$A$4:$A$560,)))-LEN(E12)-1)),MATCH(E12&\"*\",$A$4:$A$560,)),\"\")","v":""},null,null,null,null,null,null,null,null,null,null,null,null,null,null,null,"   "]
[null,null,null,null,null,null,null,null,null,null,null,null,null,null,"#",null,null,null,null,"Position",null,"   "]
[null,null,null,null,"$",{"$f":"IFERROR(INDEX(A14,MATCH(E14&\"*\",A14,)),\"-\")","v":"-"},{"$f":"IF(F14=\"-\",\"\",LEFT(F14,6))","v":""},{"$f":"MID(F14,8,50)","v":""},null,{"$f":"IF(F14=\"-\",\"-\",LEFT(F14,6))","v":"-"},{"$f":"I14","v":0},{"$f":"IF(F14=\"-\",\"\",B14)","v":""},null,null,1,{"$f":"IFERROR(INDEX((LEFT($A$4:$A$700,LEN(INDEX($A$4:$A$700,MATCH(O14&\"*\",$A$4:$A$700,)))-LEN(O14)-1)),MATCH(O14&\" *\",$A$4:$A$700,)),\"\")","v":""},{"$f":"IFERROR(RIGHT(P14,(LEN(P14)-(LEN(O14)+1))),\"\")","v":""},{"$f":"IFERROR(IF(Q14=\"\",\"\",FIND(\" AM \",Q14)),0)","v":""},{"$f":"IFERROR(IF(Q14=\"\",\"\",FIND(\" PM \",Q14)),0)","v":""},{"$f":"IFERROR(IF(AND(R14=0,S14=0),Q14,IF(R14>0,LEFT(Q14,R14-6),LEFT(Q14,S14-6))),\"\")","v":""},null,"   "]
[null,null,null,null,"$","-",{"$f":"IF(F15=\"-\",\"\",LEFT(F15,6))","v":""},"",null,"-",0,"",null,null,2,{"$f":"IFERROR(INDEX((LEFT($A$4:$A$700,LEN(INDEX($A$4:$A$700,MATCH(O15&\"*\",$A$4:$A$700,)))-LEN(O15)-1)),MATCH(O15&\" *\",$A$4:$A$700,)),\"\")","v":""},{"$f":"IFERROR(RIGHT(P15,(LEN(P15)-(LEN(O15)+1))),\"\")","v":""},{"$f":"IFERROR(IF(Q15=\"\",\"\",FIND(\" AM \",Q15)),0)","v":""},{"$f":"IFERROR(IF(Q15=\"\",\"\",FIND(\" PM \",Q15)),0)","v":""},{"$f":"IFERROR(IF(AND(R15=0,S15=0),Q15,IF(R15>0,LEFT(Q15,R15-6),LEFT(Q15,S15-6))),\"\")","v":""},null,"   "]
[null,null,null,null,"$","-","","",null,"-",0,"",null,null,3,"","","","","",null,"   "]
[null,null,null,null,"$","-","","",null,"-",0,"",null,null,4,"","","","","",null,"   "]
[null,null,null,null,"$","-","","",null,"-",0,"",null,null,5,"","","","","",null,"   "]
[null,null,null,null,"$","-","","",null,"-",0,"",null,null,6,"","","","","",null,"   "]
[null,null,null,null,"$","-","","",null,"-",0,"",null,null,7,"","","","","",null,"   "]
[null,null,null,null,"$","-","","",null,"-",0,"",null,null,8,"","","","","",null,"   "]
[null,null,null,null,"$","-","","",null,"-",0,"",null,null,9,"","","","","",null,"   "]
[null,null,null,null,"$","-","","",null,"-",0,"",null,null,10,"","","","","",null,"   "]
[null,null,null,null,"$","-","","",null,"-",0,"",null,null,11,"","","","","",null,"   "]
[null,null,null,null,"$","-","","",null,"-",0,"",null,null,12,"","","","","",null,"   "]
[null,null,null,null,"$","-","","",null,"-",0,"",null,null,13,"","","","","",null,"   "]
[null,null,null,null,"$","-","","",null,"-",0,"",null,null,14,"","","","","",null,"   "]
[null,null,null,null,"$","-","","",null,"-",0,"",null,null,15,"","","","","",null,"   "]
[null,null,null,null,"$","-","",{"$f":"MID(F29,8,50)","v":""},null,"-",0,"",null,null,16,"","","","","",null,"   "]
[null,null,null,null,"$","-","",{"$f":"MID(F30,8,50)","v":""},null,"-",0,"",null,null,17,"","","","","",null,"   "]
[null,null,null,null,"$","-","","",null,"-",0,"",null,null,18,"","","","","",null,"   "]
[null,null,null,null,"$","-","","",null,"-",0,"",null,null,19,"","","","","",null,"   "]
[null,null,null,null,"$","-","","",null,"-",0,"",null,null,20,"","","","","",null,"   "]
[null,null,null,null,"$","-","","",null,"-",0,"",null,null,21,"","","","","",null,"   "]
[null,null,null,null,"$","-","","",null,"-",0,"",null,null,22,"","","","","",null,"   "]
[null,null,null,null,"$","-","","",null,"-",0,"",null,null,23,"","","","","",null,"   "]
[null,null,null,null,"$","-","","",null,"-",0,"",null,null,24,"","","","","",null,"   "]
[null,null,null,null,"$","-","","",null,"-",0,"",null,null,25,"","","","","",null,"   "]
[null,null,null,null,"$","-","","",null,"-",0,"",null,null,26,"","","","","",null,"   "]
[null,null,null,null,"$","-","","",null,"-",0,"",null,null,27,"","","","","",null,"   "]
[null,null,null,null,"$","-","","",null,"-",0,"",null,null,28,"","","","","",null,"   "]
[null,null,null,null,"$","-","","",null,"-",0,"",null,null,29,"","","","","",null,"   "]
[null,null,null,null,"$","-","","",null,"-",0,"",null,null,30,"","","","","",null,"   "]
[null,null,null,null,"$","-","","",null,"-",0,"",null,null,31,"","","","","",null,"   "]
[null,null,null,null,"$","-","","",null,"-",0,"",null,null,32,"","","","","",null,"   "]
[null,null,null,null,"$",{"$f":"IFERROR(INDEX(A46,MATCH(E46&\"*\",A46,)),\"-\")","v":"-"},"","",null,"-",0,{"$f":"IF(F46=\"-\",\"\",B46)","v":""},null,null,33,"","","","","",null,"   "]
[null,null,null,null,"$","-","","",null,"-",0,"",null,null,34,"","","","","",null,"   "]
[null,null,null,null,"$","-","","",null,"-",0,"",null,null,35,"","","","","",null,"   "]
[null,null,null,null,"$","-","","",null,"-",0,"",null,null,36,"","","","","",null,"   "]
[null,null,null,null,"$","-","","",null,"-",0,"",null,null,37,"","","","","",null,"   "]
[null,null,null,null,"$","-","","",null,"-",0,"",null,null,38,"","","","","",null,"   "]
[null,null,null,null,"$","-","","",null,"-",0,"",null,null,39,"","","","","",null,"   "]
[null,null,null,null,"$","-","","",null,"-",0,"",null,null,40,"","","","","",null,"   "]
[null,null,null,null,"$","-","","",null,"-",0,"",null,null,41,"","","","","",null,"   "]
[null,null,null,null,"$","-","","",null,"-",0,"",null,null,42,"","","","","",null,"   "]
[null,null,null,null,"$","-","","",null,"-",0,"",null,null,43,"","","","","",null,"   "]
[null,null,null,null,"$","-","","",null,"-",0,"",null,null,44,"","","","","",null,"   "]
[null,null,null,null,"$","-","","",null,"-",0,"",null,null,45,"","","","","",null,"   "]
[null,null,null,null,"$","-","","",null,"-",0,"",null,null,46,"","","","","",null,"   "]
[null,null,null,null,"$","-","","",null,"-",0,"",null,null,47,"","","","","",null,"   "]
[null,null,null,null,"$","-","","",null,"-",0,"",null,null,48,"","","","","",null,"   "]
[null,null,null,null,"$","-","","",null,"-",0,"",null,null,49,"","","","","",null,"   "]
[null,null,null,null,"$","-","","",null,"-",0,"",null,null,50,"","","","","",null,"   "]
[null,null,null,null,"$","-","","",null,"-",0,"",null,null,51,"","","","","",null,"   "]
[null,null,null,null,"$","-","","",null,"-",0,"",null,null,52,"","","","","",null,"   "]
[null,null,null,null,"$","-","","",null,"-",0,"",null,null,53,"","","","","",null,"   "]
[null,null,null,null,"$","-","","",null,"-",0,"",null,null,54,"","","","","",null,"   "]
[null,null,null,null,"$","-","","",null,"-",0,"",null,null,55,"","","","","",null,"   "]
[null,null,null,null,"$","-","","",null,"-",0,"",null,null,56,"","","","","",null,"   "]
[null,null,null,null,"$","-","","",null,"-",0,"",null,null,57,"","","","","",null,{"$f":"CONCATENATE(A70,\" \",B70,\" \",C70,\" \",D70)","v":"   "}]
[null,null,null,null,"$","-","","",null,"-",0,"",null,null,58,"","","","","",null,"   "]
[null,null,null,null,"$","-","","",null,"-",0,"",null,null,59,"","","","","",null,"   "]
[null,null,null,null,"$","-","","",null,"-",0,"",null,null,60,"","","","","",null,"   "]
[null,null,null,null,"$","-","","",null,"-",0,"",null,null,61,"","","","","",null,"   "]
[null,null,null,null,"$","-","","",null,"-",0,"",null,null,62,"","","","","",null,"   "]
[null,null,null,null,"$","-","","",null,"-",0,"",null,null,63,"","","","","",null,"   "]
[null,null,null,null,"$","-","","",null,"-",0,"",null,null,64,"","","","","",null,"   "]
[null,null,null,null,"$",{"$f":"IFERROR(INDEX(A78,MATCH(E78&\"*\",A78,)),\"-\")","v":"-"},"","",null,{"$f":"IF(F78=\"-\",\"-\",LEFT(F78,6))","v":"-"},{"$f":"I78","v":0},{"$f":"IF(F78=\"-\",\"\",B78)","v":""},null,null,null,null,null,null,null,null,null,"   "]
[null,null,null,null,"$","-",{"$f":"IF(F79=\"-\",\"\",LEFT(F79,6))","v":""},"",null,"-",0,"",null,null,null,null,null,null,null,null,null,"   "]
[null,null,null,null,"$","-","","",null,"-",0,"",null,null,null,null,null,null,null,null,null,"   "]
[null,null,null,null,"$","-","","",null,"-",0,"",null,null,null,null,null,null,null,null,null,"   "]
[null,null,null,null,"$","-","","",null,"-",0,"",null,null,null,null,null,null,null,null,null,"   "]
[null,null,null,null,"$","-","","",null,"-",0,"",null,null,null,null,null,null,null,null,null,"   "]
[null,null,null,null,"$","-","","",null,"-",0,"",null,null,null,null,null,null,null,null,null,"   "]
[null,null,null,null,"$","-","","",null,"-",0,"",null,null,null,null,null,null,null,null,null,"   "]
[null,null,null,null,"$","-","","",null,"-",0,"",null,null,null,null,null,null,null,null,null,"   "]
[null,null,null,null,"$","-","","",null,"-",0,"",null,null,null,null,null,null,null,null,null,"   "]
[null,null,null,null,"$","-","","",null,"-",0,"",null,null,null,null,null,null,null,null,null,"   "]
[null,null,null,null,"$","-","","",null,"-",0,"",null,null,null,null,null,null,null,null,null,"   "]
[null,null,null,null,"$","-","","",null,"-",0,"",null,null,null,null,null,null,null,null,null,"   "]
[null,null,null,null,"$","-","","",null,"-",0,"",null,null,null,null,null,null,null,null,null,"   "]
[null,null,null,null,"$","-","","",null,"-",0,"",null,null,null,null,null,null,null,null,null,"   "]
[null,null,null,null,"$","-","","",null,"-",0,"",null,null,null,null,null,null,null,null,null,"   "]
[null,null,null,null,"$","-","",{"$f":"MID(F94,8,50)","v":""},null,"-",0,"",null,null,null,null,null,null,null,null,null,"   "]
[null,null,null,null,"$","-","","",null,"-",0,"",null,null,null,null,null,null,null,null,null,"   "]
[null,null,null,null,"$","-","","",null,"-",0,"",null,null,null,null,null,null,null,null,null,"   "]
[null,null,null,null,"$","-","","",null,"-",0,"",null,null,null,null,null,null,null,null,null,"   "]
[null,null,null,null,"$","-","","",null,"-",0,"",null,null,null,null,null,null,null,null,null,"   "]
[null,null,null,null,"$","-","","",null,"-",0,"",null,null,null,null,null,null,null,null,null,"   "]
[null,null,null,null,"$","-","","",null,"-",0,"",null,null,null,null,null,null,null,null,null,"   "]
[null,null,null,null,"$","-","","",null,"-",0,"",null,null,null,null,null,null,null,null,null,"   "]
[null,null,null,null,"$","-","","",null,"-",0,"",null,null,null,null,null,null,null,null,null,"   "]
[null,null,null,null,"$","-","","",null,"-",0,"",null,null,null,null,null,null,null,null,null,"   "]
[null,null,null,null,"$","-","","",null,"-",0,"",null,null,null,null,null,null,null,null,null,"   "]
[null,null,null,null,"$","-","","",null,"-",0,"",null,null,null,null,null,null,null,null,null,"   "]
[null,null,null,null,"$","-","","",null,"-",0,"",null,null,null,null,null,null,null,null,null,"   "]
[null,null,null,null,"$","-","","",null,"-",0,"",null,null,null,null,null,null,null,null,null,"   "]
[null,null,null,null,"$","-","","",null,"-",0,"",null,null,null,null,null,null,null,null,null,"   "]
[null,null,null,null,"$","-","","",null,"-",0,"",null,null,null,null,null,null,null,null,null,"   "]
[null,null,null,null,"$",{"$f":"IFERROR(INDEX(A110,MATCH(E110&\"*\",A110,)),\"-\")","v":"-"},"","",null,"-",0,{"$f":"IF(F110=\"-\",\"\",B110)","v":""},null,null,null,null,null,null,null,null,null,"   "]
[null,null,null,null,"$","-","","",null,"-",0,"",null,null,null,null,null,null,null,null,null,"   "]
[null,null,null,null,"$","-","","",null,"-",0,"",null,null,null,null,null,null,null,null,null,"   "]
[null,null,null,null,"$","-","","",null,"-",0,"",null,null,null,null,null,null,null,null,null,"   "]
[null,null,null,null,"$","-","","",null,"-",0,"",null,null,null,null,null,null,null,null,null,"   "]
[null,null,null,null,"$","-","","",null,"-",0,"",null,null,null,null,null,null,null,null,null,"   "]
[null,null,null,null,"$","-","","",null,"-",0,"",null,null,null,null,null,null,null,null,null,"   "]
[null,null,null,null,"$","-","","",null,"-",0,"",null,null,null,null,null,null,null,null,null,"   "]
[null,null,null,null,"$","-","","",null,"-",0,"",null,null,null,null,null,null,null,null,null,"   "]
[null,null,null,null,"$","-","","",null,"-",0,"",null,null,null,null,null,null,null,null,null,"   "]
[null,null,null,null,"$","-","","",null,"-",0,"",null,null,null,null,null,null,null,null,null,"   "]
[null,null,null,null,"$","-","","",null,"-",0,"",null,null,null,null,null,null,null,null,null,"   "]
[null,null,null,null,"$","-","","",null,"-",0,"",null,null,null,null,null,null,null,null,null,"   "]
[null,null,null,null,"$","-","","",null,"-",0,"",null,null,null,null,null,null,null,null,null,"   "]
[null,null,null,null,"$","-","","",null,"-",0,"",null,null,null,null,null,null,null,null,null,"   "]
[null,null,null,null,"$","-","","",null,"-",0,"",null,null,null,null,null,null,null,null,null,"   "]
[null,null,null,null,"$","-","","",null,"-",0,"",null,null,null,null,null,null,null,null,null,"   "]
[null,null,null,null,"$","-","","",null,"-",0,"",null,null,null,null,null,null,null,null,null,"   "]
[null,null,null,null,"$","-","","",null,"-",0,"",null,null,null,null,null,null,null,null,null,"   "]
[null,null,null,null,"$","-","","",null,"-",0,"",null,null,null,null,null,null,null,null,null,"   "]
[null,null,null,null,"$","-","","",null,"-",0,"",null,null,null,null,null,null,null,null,null,"   "]
[null,null,null,null,"$","-","","",null,"-",0,"",null,null,null,null,null,null,null,null,null,"   "]
[null,null,null,null,"$","-","","",null,"-",0,"",null,null,null,null,null,null,null,null,null,"   "]
[null,null,null,null,"$","-","","",null,"-",0,"",null,null,null,null,null,null,null,null,null,"   "]
[null,null,null,null,"$","-","","",null,"-",0,"",null,null,null,null,null,null,null,null,null,{"$f":"CONCATENATE(A134,\" \",B134,\" \",C134,\" \",D134)","v":"   "}]
[null,null,null,null,"$","-","","",null,"-",0,"",null,null,null,null,null,null,null,null,null,"   "]
[null,null,null,null,"$","-","","",null,"-",0,"",null,null,null,null,null,null,null,null,null,"   "]
[null,null,null,null,"$","-","","",null,"-",0,"",null,null,null,null,null,null,null,null,null,"   "]
[null,null,null,null,"$","-","","",null,"-",0,"",null,null,null,null,null,null,null,null,null,"   "]
[null,null,null,null,"$","-","","",null,"-",0,"",null,null,null,null,null,null,null,null,null,"   "]
[null,null,null,null,"$","-","","",null,"-",0,"",null,null,null,null,null,null,null,null,null,"   "]
[null,null,null,null,"$","-","","",null,"-",0,"",null,null,null,null,null,null,null,null,null,"   "]
[null,null,null,null,"$",{"$f":"IFERROR(INDEX(A142,MATCH(E142&\"*\",A142,)),\"-\")","v":"-"},"","",null,{"$f":"IF(F142=\"-\",\"-\",LEFT(F142,6))","v":"-"},{"$f":"I142","v":0},{"$f":"IF(F142=\"-\",\"\",B142)","v":""},null,null,null,null,null,null,null,null,null,"   "]
[null,null,null,null,"$","-",{"$f":"IF(F143=\"-\",\"\",LEFT(F143,6))","v":""},"",null,"-",0,"",null,null,null,null,null,null,null,null,null,"   "]
[null,null,null,null,"$","-","","",null,"-",0,"",null,null,null,null,null,null,null,null,null,"   "]
[null,null,null,null,"$","-","","",null,"-",0,"",null,null,null,null,null,null,null,null,null,"   "]
[null,null,null,null,"$","-","","",null,"-",0,"",null,null,null,null,null,null,null,null,null,"   "]
[null,null,null,null,"$","-","","",null,"-",0,"",null,null,null,null,null,null,null,null,null,"   "]
[null,null,null,null,"$","-","","",null,"-",0,"",null,null,null,null,null,null,null,null,null,"   "]
[null,null,null,null,"$","-","","",null,"-",0,"",null,null,null,null,null,null,null,null,null,"   "]
[null,null,null,null,"$","-","","",null,"-",0,"",null,null,null,null,null,null,null,null,null,"   "]
[null,null,null,null,"$","-","","",null,"-",0,"",null,null,null,null,null,null,null,null,null,"   "]
[null,null,null,null,"$","-","","",null,"-",0,"",null,null,null,null,null,null,null,null,null,"   "]
[null,null,null,null,"$","-","","",null,"-",0,"",null,null,null,null,null,null,null,null,null,"   "]
[null,null,null,null,"$","-","","",null,"-",0,"",null,null,null,null,null,null,null,null,null,"   "]
[null,null,null,null,"$","-","","",null,"-",0,"",null,null,null,null,null,null,null,null,null,"   "]
[null,null,null,null,"$","-","","",null,"-",0,"",null,null,null,null,null,null,null,null,null,"   "]
[null,null,null,null,"$","-","","",null,"-",0,"",null,null,null,null,null,null,null,null,null,"   "]
[null,null,null,null,"$","-","",{"$f":"MID(F158,8,50)","v":""},null,"-",0,"",null,null,null,null,null,null,null,null,null,"   "]
[null,null,null,null,"$","-","","",null,"-",0,"",null,null,null,null,null,null,null,null,null,"   "]
[null,null,null,null,"$","-","","",null,"-",0,"",null,null,null,null,null,null,null,null,null,"   "]
[null,null,null,null,"$","-","","",null,"-",0,"",null,null,null,null,null,null,null,null,null,"   "]
[null,null,null,null,"$","-","","",null,"-",0,"",null,null,null,null,null,null,null,null,null,"   "]
[null,null,null,null,"$","-","","",null,"-",0,"",null,null,null,null,null,null,null,null,null,"   "]
[null,null,null,null,"$","-","","",null,"-",0,"",null,null,null,null,null,null,null,null,null,"   "]
[null,null,null,null,"$","-","","",null,"-",0,"",null,null,null,null,null,null,null,null,null,"   "]
[null,null,null,null,"$","-","","",null,"-",0,"",null,null,null,null,null,null,null,null,null,"   "]
[null,null,null,null,"$","-","","",null,"-",0,"",null,null,null,null,null,null,null,null,null,"   "]
[null,null,null,null,"$","-","","",null,"-",0,"",null,null,null,null,null,null,null,null,null,"   "]
[null,null,null,null,"$","-","","",null,"-",0,"",null,null,null,null,null,null,null,null,null,"   "]
[null,null,null,null,"$","-","","",null,"-",0,"",null,null,null,null,null,null,null,null,null,"   "]
[null,null,null,null,"$","-","","",null,"-",0,"",null,null,null,null,null,null,null,null,null,"   "]
[null,null,null,null,"$","-","","",null,"-",0,"",null,null,null,null,null,null,null,null,null,"   "]
[null,null,null,null,"$","-","","",null,"-",0,"",null,null,null,null,null,null,null,null,null,"   "]
[null,null,null,null,"$",{"$f":"IFERROR(INDEX(A174,MATCH(E174&\"*\",A174,)),\"-\")","v":"-"},"","",null,"-",0,{"$f":"IF(F174=\"-\",\"\",B174)","v":""},null,null,null,null,null,null,null,null,null,"   "]
[null,null,null,null,"$","-","","",null,"-",0,"",null,null,null,null,null,null,null,null,null,"   "]
[null,null,null,null,"$","-","","",null,"-",0,"",null,null,null,null,null,null,null,null,null,"   "]
[null,null,null,null,"$","-","","",null,"-",0,"",null,null,null,null,null,null,null,null,null,"   "]
[null,null,null,null,"$","-","","",null,"-",0,"",null,null,null,null,null,null,null,null,null,"   "]
[null,null,null,null,"$","-","","",null,"-",0,"",null,null,null,null,null,null,null,null,null,"   "]
[null,null,null,null,"$","-","","",null,"-",0,"",null,null,null,null,null,null,null,null,null,"   "]
[null,null,null,null,"$","-","","",null,"-",0,"",null,null,null,null,null,null,null,null,null,"   "]
[null,null,null,null,"$","-","","",null,"-",0,"",null,null,null,null,null,null,null,null,null,"   "]
[null,null,null,null,"$","-","","",null,"-",0,"",null,null,null,null,null,null,null,null,null,"   "]
[null,null,null,null,"$","-","","",null,"-",0,"",null,null,null,null,null,null,null,null,null,"   "]
[null,null,null,null,"$","-","","",null,"-",0,"",null,null,null,null,null,null,null,null,null,"   "]
[null,null,null,null,"$","-","","",null,"-",0,"",null,null,null,null,null,null,null,null,null,"   "]
[null,null,null,null,"$","-","","",null,"-",0,"",null,null,null,null,null,null,null,null,null,"   "]
[null,null,null,null,"$","-","","",null,"-",0,"",null,null,null,null,null,null,null,null,null,"   "]
[null,null,null,null,"$","-","","",null,"-",0,"",null,null,null,null,null,null,null,null,null,"   "]
[null,null,null,null,"$","-","","",null,"-",0,"",null,null,null,null,null,null,null,null,null,"   "]
[null,null,null,null,"$","-","","",null,"-",0,"",null,null,null,null,null,null,null,null,null,"   "]
[null,null,null,null,"$","-","","",null,"-",0,"",null,null,null,null,null,null,null,null,null,"   "]
[null,null,null,null,"$","-","","",null,"-",0,"",null,null,null,null,null,null,null,null,null,"   "]
[null,null,null,null,"$","-","","",null,"-",0,"",null,null,null,null,null,null,null,null,null,"   "]
[null,null,null,null,"$","-","","",null,"-",0,"",null,null,null,null,null,null,null,null,null,"   "]
[null,null,null,null,"$","-","","",null,"-",0,"",null,null,null,null,null,null,null,null,null,"   "]
[null,null,null,null,"$","-","","",null,"-",0,"",null,null,null,null,null,null,null,null,null,"   "]
[null,null,null,null,"$","-","","",null,"-",0,"",null,null,null,null,null,null,null,null,null,{"$f":"CONCATENATE(A198,\" \",B198,\" \",C198,\" \",D198)","v":"   "}]
[null,null,null,null,"$","-","","",null,"-",0,"",null,null,null,null,null,null,null,null,null,"   "]
[null,null,null,null,"$","-","","",null,"-",0,"",null,null,null,null,null,null,null,null,null,"   "]
[null,null,null,null,"$",{"$f":"IFERROR(INDEX(A201,MATCH(E201&\"*\",A201,)),\"-\")","v":"-"},{"$f":"IF(F201=\"-\",\"\",LEFT(F201,6))","v":""},{"$f":"MID(F201,8,50)","v":""},null,{"$f":"IF(F201=\"-\",\"-\",LEFT(F201,6))","v":"-"},{"$f":"I201","v":0},{"$f":"IF(F201=\"-\",\"\",B201)","v":""},null,null,null,null,null,null,null,null,null,"   "]
[null,null,null,null,"$","-","","",null,"-",0,"",null,null,null,null,null,null,null,null,null,"   "]
[null,null,null,null,"$","-","","",null,"-",0,"",null,null,null,null,null,null,null,null,null,"   "]
[null,null,null,null,"$","-","","",null,"-",0,"",null,null,null,null,null,null,null,null,null,"   "]
[null,null,null,null,"$","-","","",null,"-",0,"",null,null,null,null,null,null,null,null,null,"   "]
[null,null,null,null,"$","-","","",null,"-",0,"",null,null,null,null,null,null,null,null,null,"   "]
[null,null,null,null,"$","-","","",null,"-",0,"",null,null,null,null,null,null,null,null,null,"   "]
[null,null,null,null,"$","-","","",null,"-",0,"",null,null,null,null,null,null,null,null,null,"   "]
[null,null,null,null,"$","-","","",null,"-",0,"",null,null,null,null,null,null,null,null,null,"   "]
[null,null,null,null,"$","-","","",null,"-",0,"",null,null,null,null,null,null,null,null,null,"   "]
[null,null,null,null,"$","-","","",null,"-",0,"",null,null,null,null,null,null,null,null,null,"   "]
[null,null,null,null,"$","-","","",null,"-",0,"",null,null,null,null,null,null,null,null,null,"   "]
[null,null,null,null,"$","-","","",null,"-",0,"",null,null,null,null,null,null,null,null,null,"   "]
[null,null,null,null,"$","-","","",null,"-",0,"",null,null,null,null,null,null,null,null,null,"   "]
[null,null,null,null,"$","-","","",null,"-",0,"",null,null,null,null,null,null,null,null,null,"   "]
[null,null,null,null,"$","-","","",null,"-",0,"",null,null,null,null,null,null,null,null,null,"   "]
[null,null,null,null,"$","-","","",null,"-",0,"",null,null,null,null,null,null,null,null,null,"   "]
[null,null,null,null,"$","-","","",null,"-",0,"",null,null,null,null,null,null,null,null,null,"   "]
[null,null,null,null,"$","-","","",null,"-",0,"",null,null,null,null,null,null,null,null,null,"   "]
[null,null,null,null,"$","-","","",null,"-",0,"",null,null,null,null,null,null,null,null,null,"   "]
[null,null,null,null,"$","-","","",null,"-",0,"",null,null,null,null,null,null,null,null,null,"   "]
[null,null,null,null,"$","-","","",null,"-",0,"",null,null,null,null,null,null,null,null,null,"   "]
[null,null,null,null,"$","-","","",null,"-",0,"",null,null,null,null,null,null,null,null,null,"   "]
[null,null,null,null,"$","-","","",null,"-",0,"",null,null,null,null,null,null,null,null,null,"   "]
[null,null,null,null,"$","-","","",null,"-",0,"",null,null,null,null,null,null,null,null,null,"   "]
[null,null,null,null,"$","-","","",null,"-",0,"",null,null,null,null,null,null,null,null,null,"   "]
[null,null,null,null,"$","-","","",null,"-",0,"",null,null,null,null,null,null,null,null,null,"   "]
[null,null,null,null,"$","-","","",null,"-",0,"",null,null,null,null,null,null,null,null,null,"   "]
[null,null,null,null,"$","-","","",null,"-",0,"",null,null,null,null,null,null,null,null,null,"   "]
[null,null,null,null,"$","-","","",null,"-",0,"",null,null,null,null,null,null,null,null,null,"   "]
[null,null,null,null,"$","-","","",null,"-",0,"",null,null,null,null,null,null,null,null,null,"   "]
[null,null,null,null,"$","-","","",null,"-",0,"",null,null,null,null,null,null,null,null,null,"   "]
[null,null,null,null,"$","-","","",null,"-",0,"",null,null,null,null,null,null,null,null,null,"   "]
[null,null,null,null,"$","-","","",null,"-",0,"",null,null,null,null,null,null,null,null,null,"   "]
[null,null,null,null,"$","-","","",null,"-",0,"",null,null,null,null,null,null,null,null,null,"   "]
[null,null,null,null,"$","-","","",null,"-",0,"",null,null,null,null,null,null,null,null,null,"   "]
[null,null,null,null,"$","-","","",null,"-",0,"",null,null,null,null,null,null,null,null,null,"   "]
[null,null,null,null,"$","-","","",null,"-",0,"",null,null,null,null,null,null,null,null,null,"   "]
[null,null,null,null,"$","-","","",null,"-",0,"",null,null,null,null,null,null,null,null,null,"   "]
[null,null,null,null,"$","-","","",null,"-",0,"",null,null,null,null,null,null,null,null,null,"   "]
[null,null,null,null,"$","-","","",null,"-",0,"",null,null,null,null,null,null,null,null,null,"   "]
[null,null,null,null,"$","-","","",null,"-",0,"",null,null,null,null,null,null,null,null,null,"   "]
[null,null,null,null,"$","-","","",null,"-",0,"",null,null,null,null,null,null,null,null,null,"   "]
[null,null,null,null,"$","-","","",null,"-",0,"",null,null,null,null,null,null,null,null,null,"   "]
[null,null,null,null,"$","-","","",null,"-",0,"",null,null,null,null,null,null,null,null,null,"   "]
[null,null,null,null,"$","-","","",null,"-",0,"",null,null,null,null,null,null,null,null,null,"   "]
[null,null,null,null,"$","-","","",null,"-",0,"",null,null,null,null,null,null,null,null,null,"   "]
[null,null,null,null,"$","-","","",null,"-",0,"",null,null,null,null,null,null,null,null,null,"   "]
[null,null,null,null,"$","-","","",null,"-",0,"",null,null,null,null,null,null,null,null,null,"   "]
[null,null,null,null,"$","-","","",null,"-",0,"",null,null,null,null,null,null,null,null,null,"   "]
[null,null,null,null,"$","-","","",null,"-",0,"",null,null,null,null,null,null,null,null,null,"   "]
[null,null,null,null,"$","-","","",null,"-",0,"",null,null,null,null,null,null,null,null,null,"   "]
[null,null,null,null,"$","-","","",null,"-",0,"",null,null,null,null,null,null,null,null,null,"   "]
[null,null,null,null,"$","-","","",null,"-",0,"",null,null,null,null,null,null,null,null,null,"   "]
[null,null,null,null,"$","-","","",null,"-",0,"",null,null,null,null,null,null,null,null,null,"   "]
[null,null,null,null,"$","-","","",null,"-",0,"",null,null,null,null,null,null,null,null,null,"   "]
[null,null,null,null,"$","-","","",null,"-",0,"",null,null,null,null,null,null,null,null,null,"   "]
[null,null,null,null,"$","-","","",null,"-",0,"",null,null,null,null,null,null,null,null,null,"   "]
[null,null,null,null,"$","-","","",null,"-",0,"",null,null,null,null,null,null,null,null,null,"   "]
[null,null,null,null,"$","-","","",null,"-",0,"",null,null,null,null,null,null,null,null,null,"   "]
[null,null,null,null,"$","-","","",null,"-",0,"",null,null,null,null,null,null,null,null,null,"   "]
[null,null,null,null,"$","-","","",null,"-",0,"",null,null,null,null,null,null,null,null,null,{"$f":"CONCATENATE(A262,\" \",B262,\" \",C262,\" \",D262)","v":"   "}]
[null,null,null,null,"$","-","","",null,"-",0,"",null,null,null,null,null,null,null,null,null,"   "]
[null,null,null,null,"$","-","","",null,"-",0,"",null,null,null,null,null,null,null,null,null,"   "]
[null,null,null,null,"$",{"$f":"IFERROR(INDEX(A265,MATCH(E265&\"*\",A265,)),\"-\")","v":"-"},{"$f":"IF(F265=\"-\",\"\",LEFT(F265,6))","v":""},{"$f":"MID(F265,8,50)","v":""},null,{"$f":"IF(F265=\"-\",\"-\",LEFT(F265,6))","v":"-"},{"$f":"I265","v":0},{"$f":"IF(F265=\"-\",\"\",B265)","v":""},null,null,null,null,null,null,null,null,null,"   "]
[null,null,null,null,"$","-","","",null,"-",0,"",null,null,null,null,null,null,null,null,null,"   "]
[null,null,null,null,"$","-","","",null,"-",0,"",null,null,null,null,null,null,null,null,null,"   "]
[null,null,null,null,"$","-","","",null,"-",0,"",null,null,null,null,null,null,null,null,null,"   "]
[null,null,null,null,"$","-","","",null,"-",0,"",null,null,null,null,null,null,null,null,null,"   "]
[null,null,null,null,"$","-","","",null,"-",0,"",null,null,null,null,null,null,null,null,null,"   "]
[null,null,null,null,"$","-","","",null,"-",0,"",null,null,null,null,null,null,null,null,null,"   "]
[null,null,null,null,"$","-","","",null,"-",0,"",null,null,null,null,null,null,null,null,null,"   "]
[null,null,null,null,"$","-","","",null,"-",0,"",null,null,null,null,null,null,null,null,null,"   "]
[null,null,null,null,"$","-","","",null,"-",0,"",null,null,null,null,null,null,null,null,null,"   "]
[null,null,null,null,"$","-","","",null,"-",0,"",null,null,null,null,null,null,null,null,null,"   "]
[null,null,null,null,"$","-","","",null,"-",0,"",null,null,null,null,null,null,null,null,null,"   "]
[null,null,null,null,"$","-","","",null,"-",0,"",null,null,null,null,null,null,null,null,null,"   "]
[null,null,null,null,"$","-","","",null,"-",0,"",null,null,null,null,null,null,null,null,null,"   "]
[null,null,null,null,"$","-","","",null,"-",0,"",null,null,null,null,null,null,null,null,null,"   "]
[null,null,null,null,"$","-","","",null,"-",0,"",null,null,null,null,null,null,null,null,null,"   "]
[null,null,null,null,"$","-","","",null,"-",0,"",null,null,null,null,null,null,null,null,null,"   "]
[null,null,null,null,"$","-","","",null,"-",0,"",null,null,null,null,null,null,null,null,null,"   "]
[null,null,null,null,"$","-","","",null,"-",0,"",null,null,null,null,null,null,null,null,null,"   "]
[null,null,null,null,"$","-","","",null,"-",0,"",null,null,null,null,null,null,null,null,null,"   "]
[null,null,null,null,"$","-","","",null,"-",0,"",null,null,null,null,null,null,null,null,null,"   "]
[null,null,null,null,"$","-","","",null,"-",0,"",null,null,null,null,null,null,null,null,null,"   "]
[null,null,null,null,"$","-","","",null,"-",0,"",null,null,null,null,null,null,null,null,null,"   "]
[null,null,null,null,"$","-","","",null,"-",0,"",null,null,null,null,null,null,null,null,null,"   "]
[null,null,null,null,"$","-","","",null,"-",0,"",null,null,null,null,null,null,null,null,null,"   "]
[null,null,null,null,"$","-","","",null,"-",0,"",null,null,null,null,null,null,null,null,null,"   "]
[null,null,null,null,"$","-","","",null,"-",0,"",null,null,null,null,null,null,null,null,null,"   "]
[null,null,null,null,"$","-","","",null,"-",0,"",null,null,null,null,null,null,null,null,null,"   "]
[null,null,null,null,"$","-","","",null,"-",0,"",null,null,null,null,null,null,null,null,null,"   "]
[null,null,null,null,"$","-","","",null,"-",0,"",null,null,null,null,null,null,null,null,null,"   "]
[null,null,null,null,"$","-","","",null,"-",0,"",null,null,null,null,null,null,null,null,null,"   "]
[null,null,null,null,"$","-","","",null,"-",0,"",null,null,null,null,null,null,null,null,null,"   "]
[null,null,null,null,"$","-","","",null,"-",0,"",null,null,null,null,null,null,null,null,null,"   "]
[null,null,null,null,"$","-","","",null,"-",0,"",null,null,null,null,null,null,null,null,null,"   "]
[null,null,null,null,"$","-","","",null,"-",0,"",null,null,null,null,null,null,null,null,null,"   "]
[null,null,null,null,"$","-","","",null,"-",0,"",null,null,null,null,null,null,null,null,null,"   "]
[null,null,null,null,"$","-","","",null,"-",0,"",null,null,null,null,null,null,null,null,null,"   "]
[null,null,null,null,"$","-","","",null,"-",0,"",null,null,null,null,null,null,null,null,null,"   "]
[null,null,null,null,"$","-","","",null,"-",0,"",null,null,null,null,null,null,null,null,null,"   "]
[null,null,null,null,"$","-","","",null,"-",0,"",null,null,null,null,null,null,null,null,null,"   "]
[null,null,null,null,"$","-","","",null,"-",0,"",null,null,null,null,null,null,null,null,null,"   "]
[null,null,null,null,"$","-","","",null,"-",0,"",null,null,null,null,null,null,null,null,null,"   "]
[null,null,null,null,"$","-","","",null,"-",0,"",null,null,null,null,null,null,null,null,null,"   "]
[null,null,null,null,"$","-","","",null,"-",0,"",null,null,null,null,null,null,null,null,null,"   "]
[null,null,null,null,"$","-","","",null,"-",0,"",null,null,null,null,null,null,null,null,null,"   "]
[null,null,null,null,"$","-","","",null,"-",0,"",null,null,null,null,null,null,null,null,null,"   "]
[null,null,null,null,"$","-","","",null,"-",0,"",null,null,null,null,null,null,null,null,null,"   "]
[null,null,null,null,"$","-","","",null,"-",0,"",null,null,null,null,null,null,null,null,null,"   "]
[null,null,null,null,"$","-","","",null,"-",0,"",null,null,null,null,null,null,null,null,null,"   "]
[null,null,null,null,"$","-","","",null,"-",0,"",null,null,null,null,null,null,null,null,null,"   "]
[null,null,null,null,"$","-","","",null,"-",0,"",null,null,null,null,null,null,null,null,null,"   "]
[null,null,null,null,"$","-","","",null,"-",0,"",null,null,null,null,null,null,null,null,null,"   "]
[null,null,null,null,"$","-","","",null,"-",0,"",null,null,null,null,null,null,null,null,null,"   "]
[null,null,null,null,"$","-","","",null,"-",0,"",null,null,null,null,null,null,null,null,null,"   "]
[null,null,null,null,"$","-","","",null,"-",0,"",null,null,null,null,null,null,null,null,null,"   "]
[null,null,null,null,"$","-","","",null,"-",0,"",null,null,null,null,null,null,null,null,null,"   "]
[null,null,null,null,"$","-","","",null,"-",0,"",null,null,null,null,null,null,null,null,null,"   "]
[null,null,null,null,"$","-","","",null,"-",0,"",null,null,null,null,null,null,null,null,null,"   "]
[null,null,null,null,"$","-","","",null,"-",0,"",null,null,null,null,null,null,null,null,null,"   "]
[null,null,null,null,"$","-","","",null,"-",0,"",null,null,null,null,null,null,null,null,null,"   "]
[null,null,null,null,"$","-","","",null,"-",0,"",null,null,null,null,null,null,null,null,null,"   "]
[null,null,null,null,"$","-","","",null,"-",0,"",null,null,null,null,null,null,null,null,null,{"$f":"CONCATENATE(A326,\" \",B326,\" \",C326,\" \",D326)","v":"   "}]
[null,null,null,null,"$","-","","",null,"-",0,"",null,null,null,null,null,null,null,null,null,"   "]
[null,null,null,null,"$","-","","",null,"-",0,"",null,null,null,null,null,null,null,null,null,"   "]
[null,null,null,null,"$",{"$f":"IFERROR(INDEX(A329,MATCH(E329&\"*\",A329,)),\"-\")","v":"-"},{"$f":"IF(F329=\"-\",\"\",LEFT(F329,6))","v":""},{"$f":"MID(F329,8,50)","v":""},null,{"$f":"IF(F329=\"-\",\"-\",LEFT(F329,6))","v":"-"},{"$f":"I329","v":0},{"$f":"IF(F329=\"-\",\"\",B329)","v":""},null,null,null,null,null,null,null,null,null,"   "]
[null,null,null,null,"$","-","","",null,"-",0,"",null,null,null,null,null,null,null,null,null,"   "]
[null,null,null,null,"$","-","","",null,"-",0,"",null,null,null,null,null,null,null,null,null,"   "]
[null,null,null,null,"$","-","","",null,"-",0,"",null,null,null,null,null,null,null,null,null,"   "]
[null,null,null,null,"$","-","","",null,"-",0,"",null,null,null,null,null,null,null,null,null,"   "]
[null,null,null,null,"$","-","","",null,"-",0,"",null,null,null,null,null,null,null,null,null,"   "]
[null,null,null,null,"$","-","","",null,"-",0,"",null,null,null,null,null,null,null,null,null,"   "]
[null,null,null,null,"$","-","","",null,"-",0,"",null,null,null,null,null,null,null,null,null,"   "]
[null,null,null,null,"$","-","","",null,"-",0,"",null,null,null,null,null,null,null,null,null,"   "]
[null,null,null,null,"$","-","","",null,"-",0,"",null,null,null,null,null,null,null,null,null,"   "]
[null,null,null,null,"$","-","","",null,"-",0,"",null,null,null,null,null,null,null,null,null,"   "]
[null,null,null,null,"$","-","","",null,"-",0,"",null,null,null,null,null,null,null,null,null,"   "]
[null,null,null,null,"$","-","","",null,"-",0,"",null,null,null,null,null,null,null,null,null,"   "]
[null,null,null,null,"$","-","","",null,"-",0,"",null,null,null,null,null,null,null,null,null,"   "]
[null,null,null,null,"$","-","","",null,"-",0,"",null,null,null,null,null,null,null,null,null,"   "]
[null,null,null,null,"$","-","","",null,"-",0,"",null,null,null,null,null,null,null,null,null,"   "]
[null,null,null,null,"$","-","","",null,"-",0,"",null,null,null,null,null,null,null,null,null,"   "]
[null,null,null,null,"$","-","","",null,"-",0,"",null,null,null,null,null,null,null,null,null,"   "]
[null,null,null,null,"$","-","","",null,"-",0,"",null,null,null,null,null,null,null,null,null,"   "]
[null,null,null,null,"$","-","","",null,"-",0,"",null,null,null,null,null,null,null,null,null,"   "]
[null,null,null,null,"$","-","","",null,"-",0,"",null,null,null,null,null,null,null,null,null,"   "]
[null,null,null,null,"$","-","","",null,"-",0,"",null,null,null,null,null,null,null,null,null,"   "]
[null,null,null,null,"$","-","","",null,"-",0,"",null,null,null,null,null,null,null,null,null,"   "]
[null,null,null,null,"$","-","","",null,"-",0,"",null,null,null,null,null,null,null,null,null,"   "]
[null,null,null,null,"$","-","","",null,"-",0,"",null,null,null,null,null,null,null,null,null,"   "]
[null,null,null,null,"$","-","","",null,"-",0,"",null,null,null,null,null,null,null,null,null,"   "]
[null,null,null,null,"$","-","","",null,"-",0,"",null,null,null,null,null,null,null,null,null,"   "]
[null,null,null,null,"$","-","","",null,"-",0,"",null,null,null,null,null,null,null,null,null,"   "]
[null,null,null,null,"$","-","","",null,"-",0,"",null,null,null,null,null,null,null,null,null,"   "]
[null,null,null,null,"$","-","","",null,"-",0,"",null,null,null,null,null,null,null,null,null,"   "]
[null,null,null,null,"$","-","","",null,"-",0,"",null,null,null,null,null,null,null,null,null,"   "]
[null,null,null,null,"$","-","","",null,"-",0,"",null,null,null,null,null,null,null,null,null,"   "]
[null,null,null,null,"$","-","","",null,"-",0,"",null,null,null,null,null,null,null,null,null,"   "]
[null,null,null,null,"$","-","","",null,"-",0,"",null,null,null,null,null,null,null,null,null,"   "]
[null,null,null,null,"$","-","","",null,"-",0,"",null,null,null,null,null,null,null,null,null,"   "]
[null,null,null,null,"$","-","","",null,"-",0,"",null,null,null,null,null,null,null,null,null,"   "]
[null,null,null,null,"$","-","","",null,"-",0,"",null,null,null,null,null,null,null,null,null,"   "]
[null,null,null,null,"$","-","","",null,"-",0,"",null,null,null,null,null,null,null,null,null,"   "]
[null,null,null,null,"$","-","","",null,"-",0,"",null,null,null,null,null,null,null,null,null,"   "]
[null,null,null,null,"$","-","","",null,"-",0,"",null,null,null,null,null,null,null,null,null,"   "]
[null,null,null,null,"$","-","","",null,"-",0,"",null,null,null,null,null,null,null,null,null,"   "]
[null,null,null,null,"$","-","","",null,"-",0,"",null,null,null,null,null,null,null,null,null,"   "]
[null,null,null,null,"$","-","","",null,"-",0,"",null,null,null,null,null,null,null,null,null,"   "]
[null,null,null,null,"$","-","","",null,"-",0,"",null,null,null,null,null,null,null,null,null,"   "]
[null,null,null,null,"$","-","","",null,"-",0,"",null,null,null,null,null,null,null,null,null,"   "]
[null,null,null,null,"$","-","","",null,"-",0,"",null,null,null,null,null,null,null,null,null,"   "]
[null,null,null,null,"$","-","","",null,"-",0,"",null,null,null,null,null,null,null,null,null,"   "]
[null,null,null,null,"$","-","","",null,"-",0,"",null,null,null,null,null,null,null,null,null,"   "]
[null,null,null,null,"$","-","","",null,"-",0,"",null,null,null,null,null,null,null,null,null,"   "]
[null,null,null,null,"$","-","","",null,"-",0,"",null,null,null,null,null,null,null,null,null,"   "]
[null,null,null,null,"$","-","","",null,"-",0,"",null,null,null,null,null,null,null,null,null,"   "]
[null,null,null,null,"$","-","","",null,"-",0,"",null,null,null,null,null,null,null,null,null,"   "]
[null,null,null,null,"$","-","","",null,"-",0,"",null,null,null,null,null,null,null,null,null,"   "]
[null,null,null,null,"$","-","","",null,"-",0,"",null,null,null,null,null,null,null,null,null,"   "]
[null,null,null,null,"$","-","","",null,"-",0,"",null,null,null,null,null,null,null,null,null,"   "]
[null,null,null,null,"$","-","","",null,"-",0,"",null,null,null,null,null,null,null,null,null,"   "]
[null,null,null,null,"$","-","","",null,"-",0,"",null,null,null,null,null,null,null,null,null,"   "]
[null,null,null,null,"$","-","","",null,"-",0,"",null,null,null,null,null,null,null,null,null,"   "]
[null,null,null,null,"$","-","","",null,"-",0,"",null,null,null,null,null,null,null,null,null,"   "]
[null,null,null,null,"$","-","","",null,"-",0,"",null,null,null,null,null,null,null,null,null,"   "]
[null,null,null,null,"$","-","","",null,"-",0,"",null,null,null,null,null,null,null,null,null,"   "]
[null,null,null,null,"$","-","","",null,"-",0,"",null,null,null,null,null,null,null,null,null,{"$f":"CONCATENATE(A390,\" \",B390,\" \",C390,\" \",D390)","v":"   "}]
[null,null,null,null,"$","-","","",null,"-",0,"",null,null,null,null,null,null,null,null,null,"   "]
[null,null,null,null,"$","-","","",null,"-",0,"",null,null,null,null,null,null,null,null,null,"   "]
[null,null,null,null,"$",{"$f":"IFERROR(INDEX(A393,MATCH(E393&\"*\",A393,)),\"-\")","v":"-"},{"$f":"IF(F393=\"-\",\"\",LEFT(F393,6))","v":""},{"$f":"MID(F393,8,50)","v":""},null,{"$f":"IF(F393=\"-\",\"-\",LEFT(F393,6))","v":"-"},{"$f":"I393","v":0},{"$f":"IF(F393=\"-\",\"\",B393)","v":""},null,null,null,null,null,null,null,null,null,"   "]
[null,null,null,null,"$","-","","",null,"-",0,"",null,null,null,null,null,null,null,null,null,"   "]
[null,null,null,null,"$","-","","",null,"-",0,"",null,null,null,null,null,null,null,null,null,"   "]
[null,null,null,null,"$","-","","",null,"-",0,"",null,null,null,null,null,null,null,null,null,"   "]
[null,null,null,null,"$","-","","",null,"-",0,"",null,null,null,null,null,null,null,null,null,"   "]
[null,null,null,null,"$","-","","",null,"-",0,"",null,null,null,null,null,null,null,null,null,"   "]
[null,null,null,null,"$","-","","",null,"-",0,"",null,null,null,null,null,null,null,null,null,"   "]
[null,null,null,null,"$","-","","",null,"-",0,"",null,null,null,null,null,null,null,null,null,"   "]
[null,null,null,null,"$","-","","",null,"-",0,"",null,null,null,null,null,null,null,null,null,"   "]
[null,null,null,null,"$","-","","",null,"-",0,"",null,null,null,null,null,null,null,null,null,"   "]
[null,null,null,null,"$","-","","",null,"-",0,"",null,null,null,null,null,null,null,null,null,"   "]
[null,null,null,null,"$","-","","",null,"-",0,"",null,null,null,null,null,null,null,null,null,"   "]
[null,null,null,null,"$","-","","",null,"-",0,"",null,null,null,null,null,null,null,null,null,"   "]
[null,null,null,null,"$","-","","",null,"-",0,"",null,null,null,null,null,null,null,null,null,"   "]
[null,null,null,null,"$","-","","",null,"-",0,"",null,null,null,null,null,null,null,null,null,"   "]
[null,null,null,null,"$","-","","",null,"-",0,"",null,null,null,null,null,null,null,null,null,"   "]
[null,null,null,null,"$","-","","",null,"-",0,"",null,null,null,null,null,null,null,null,null,"   "]
[null,null,null,null,"$","-","","",null,"-",0,"",null,null,null,null,null,null,null,null,null,"   "]
[null,null,null,null,"$","-","","",null,"-",0,"",null,null,null,null,null,null,null,null,null,"   "]
[null,null,null,null,"$","-","","",null,"-",0,"",null,null,null,null,null,null,null,null,null,"   "]
[null,null,null,null,"$","-","","",null,"-",0,"",null,null,null,null,null,null,null,null,null,"   "]
[null,null,null,null,"$","-","","",null,"-",0,"",null,null,null,null,null,null,null,null,null,"   "]
[null,null,null,null,"$","-","","",null,"-",0,"",null,null,null,null,null,null,null,null,null,"   "]
[null,null,null,null,"$","-","","",null,"-",0,"",null,null,null,null,null,null,null,null,null,"   "]
[null,null,null,null,"$","-","","",null,"-",0,"",null,null,null,null,null,null,null,null,null,"   "]
[null,null,null,null,"$","-","","",null,"-",0,"",null,null,null,null,null,null,null,null,null,"   "]
[null,null,null,null,"$","-","","",null,"-",0,"",null,null,null,null,null,null,null,null,null,"   "]
[null,null,null,null,"$","-","","",null,"-",0,"",null,null,null,null,null,null,null,null,null,"   "]
[null,null,null,null,"$","-","","",null,"-",0,"",null,null,null,null,null,null,null,null,null,"   "]
[null,null,null,null,"$","-","","",null,"-",0,"",null,null,null,null,null,null,null,null,null,"   "]
[null,null,null,null,"$","-","","",null,"-",0,"",null,null,null,null,null,null,null,null,null,"   "]
[null,null,null,null,"$","-","","",null,"-",0,"",null,null,null,null,null,null,null,null,null,"   "]
[null,null,null,null,"$","-","","",null,"-",0,"",null,null,null,null,null,null,null,null,null,"   "]
[null,null,null,null,"$","-","","",null,"-",0,"",null,null,null,null,null,null,null,null,null,"   "]
[null,null,null,null,"$","-","","",null,"-",0,"",null,null,null,null,null,null,null,null,null,"   "]
[null,null,null,null,"$","-","","",null,"-",0,"",null,null,null,null,null,null,null,null,null,"   "]
[null,null,null,null,"$","-","","",null,"-",0,"",null,null,null,null,null,null,null,null,null,"   "]
[null,null,null,null,"$","-","","",null,"-",0,"",null,null,null,null,null,null,null,null,null,"   "]
[null,null,null,null,"$","-","","",null,"-",0,"",null,null,null,null,null,null,null,null,null,"   "]
[null,null,null,null,"$","-","","",null,"-",0,"",null,null,null,null,null,null,null,null,null,"   "]
[null,null,null,null,"$","-","","",null,"-",0,"",null,null,null,null,null,null,null,null,null,"   "]
[null,null,null,null,"$","-","","",null,"-",0,"",null,null,null,null,null,null,null,null,null,"   "]
[null,null,null,null,"$","-","","",null,"-",0,"",null,null,null,null,null,null,null,null,null,"   "]
[null,null,null,null,"$","-","","",null,"-",0,"",null,null,null,null,null,null,null,null,null,"   "]
[null,null,null,null,"$","-","","",null,"-",0,"",null,null,null,null,null,null,null,null,null,"   "]
[null,null,null,null,"$","-","","",null,"-",0,"",null,null,null,null,null,null,null,null,null,"   "]
[null,null,null,null,"$","-","","",null,"-",0,"",null,null,null,null,null,null,null,null,null,"   "]
[null,null,null,null,"$","-","","",null,"-",0,"",null,null,null,null,null,null,null,null,null,"   "]
[null,null,null,null,"$","-","","",null,"-",0,"",null,null,null,null,null,null,null,null,null,"   "]
[null,null,null,null,"$","-","","",null,"-",0,"",null,null,null,null,null,null,null,null,null,"   "]
[null,null,null,null,"$","-","","",null,"-",0,"",null,null,null,null,null,null,null,null,null,"   "]
[null,null,null,null,"$","-","","",null,"-",0,"",null,null,null,null,null,null,null,null,null,"   "]
[null,null,null,null,"$","-","","",null,"-",0,"",null,null,null,null,null,null,null,null,null,"   "]
[null,null,null,null,"$","-","","",null,"-",0,"",null,null,null,null,null,null,null,null,null,"   "]
[null,null,null,null,"$","-","","",null,"-",0,"",null,null,null,null,null,null,null,null,null,"   "]
[null,null,null,null,"$","-","","",null,"-",0,"",null,null,null,null,null,null,null,null,null,"   "]
[null,null,null,null,"$","-","","",null,"-",0,"",null,null,null,null,null,null,null,null,null,"   "]
[null,null,null,null,"$","-","","",null,"-",0,"",null,null,null,null,null,null,null,null,null,"   "]
[null,null,null,null,"$","-","","",null,"-",0,"",null,null,null,null,null,null,null,null,null,"   "]
[null,null,null,null,"$","-","","",null,"-",0,"",null,null,null,null,null,null,null,null,null,"   "]
[null,null,null,null,"$","-","","",null,"-",0,"",null,null,null,null,null,null,null,null,null,"   "]
[null,null,null,null,"$","-","","",null,"-",0,"",null,null,null,null,null,null,null,null,null,{"$f":"CONCATENATE(A454,\" \",B454,\" \",C454,\" \",D454)","v":"   "}]
[null,null,null,null,"$","-","","",null,"-",0,"",null,null,null,null,null,null,null,null,null,"   "]
[null,null,null,null,"$","-","","",null,"-",0,"",null,null,null,null,null,null,null,null,null,"   "]
[null,null,null,null,"$",{"$f":"IFERROR(INDEX(A457,MATCH(E457&\"*\",A457,)),\"-\")","v":"-"},{"$f":"IF(F457=\"-\",\"\",LEFT(F457,6))","v":""},{"$f":"MID(F457,8,50)","v":""},null,{"$f":"IF(F457=\"-\",\"-\",LEFT(F457,6))","v":"-"},{"$f":"I457","v":0},{"$f":"IF(F457=\"-\",\"\",B457)","v":""},null,null,null,null,null,null,null,null,null,"   "]
[null,null,null,null,"$","-","","",null,"-",0,"",null,null,null,null,null,null,null,null,null,"   "]
[null,null,null,null,"$","-","","",null,"-",0,"",null,null,null,null,null,null,null,null,null,"   "]
[null,null,null,null,"$","-","","",null,"-",0,"",null,null,null,null,null,null,null,null,null,"   "]
[null,null,null,null,"$","-","","",null,"-",0,"",null,null,null,null,null,null,null,null,null,"   "]
[null,null,null,null,"$","-","","",null,"-",0,"",null,null,null,null,null,null,null,null,null,"   "]
[null,null,null,null,"$","-","","",null,"-",0,"",null,null,null,null,null,null,null,null,null,"   "]
[null,null,null,null,"$","-","","",null,"-",0,"",null,null,null,null,null,null,null,null,null,"   "]
[null,null,null,null,"$","-","","",null,"-",0,"",null,null,null,null,null,null,null,null,null,"   "]
[null,null,null,null,"$","-","","",null,"-",0,"",null,null,null,null,null,null,null,null,null,"   "]
[null,null,null,null,"$","-","","",null,"-",0,"",null,null,null,null,null,null,null,null,null,"   "]
[null,null,null,null,"$","-","","",null,"-",0,"",null,null,null,null,null,null,null,null,null,"   "]
[null,null,null,null,"$","-","","",null,"-",0,"",null,null,null,null,null,null,null,null,null,"   "]
[null,null,null,null,"$","-","","",null,"-",0,"",null,null,null,null,null,null,null,null,null,"   "]
[null,null,null,null,"$","-","","",null,"-",0,"",null,null,null,null,null,null,null,null,null,"   "]
[null,null,null,null,"$","-","","",null,"-",0,"",null,null,null,null,null,null,null,null,null,"   "]
[null,null,null,null,"$","-","","",null,"-",0,"",null,null,null,null,null,null,null,null,null,"   "]
[null,null,null,null,"$","-","","",null,"-",0,"",null,null,null,null,null,null,null,null,null,"   "]
[null,null,null,null,"$","-","","",null,"-",0,"",null,null,null,null,null,null,null,null,null,"   "]
[null,null,null,null,"$","-","","",null,"-",0,"",null,null,null,null,null,null,null,null,null,"   "]
[null,null,null,null,"$","-","","",null,"-",0,"",null,null,null,null,null,null,null,null,null,"   "]
[null,null,null,null,"$","-","","",null,"-",0,"",null,null,null,null,null,null,null,null,null,"   "]
[null,null,null,null,"$","-","","",null,"-",0,"",null,null,null,null,null,null,null,null,null,"   "]
[null,null,null,null,"$","-","","",null,"-",0,"",null,null,null,null,null,null,null,null,null,"   "]
[null,null,null,null,"$","-","","",null,"-",0,"",null,null,null,null,null,null,null,null,null,"   "]
[null,null,null,null,"$","-","","",null,"-",0,"",null,null,null,null,null,null,null,null,null,"   "]
[null,null,null,null,"$","-","","",null,"-",0,"",null,null,null,null,null,null,null,null,null,"   "]
[null,null,null,null,"$","-","","",null,"-",0,"",null,null,null,null,null,null,null,null,null,"   "]
[null,null,null,null,"$","-","","",null,"-",0,"",null,null,null,null,null,null,null,null,null,"   "]
[null,null,null,null,"$","-","","",null,"-",0,"",null,null,null,null,null,null,null,null,null,"   "]
[null,null,null,null,"$","-","","",null,"-",0,"",null,null,null,null,null,null,null,null,null,"   "]
[null,null,null,null,"$","-","","",null,"-",0,"",null,null,null,null,null,null,null,null,null,"   "]
[null,null,null,null,"$","-","","",null,"-",0,"",null,null,null,null,null,null,null,null,null,"   "]
[null,null,null,null,"$","-","","",null,"-",0,"",null,null,null,null,null,null,null,null,null,"   "]
[null,null,null,null,"$","-","","",null,"-",0,"",null,null,null,null,null,null,null,null,null,"   "]
[null,null,null,null,"$","-","","",null,"-",0,"",null,null,null,null,null,null,null,null,null,"   "]
[null,null,null,null,"$","-","","",null,"-",0,"",null,null,null,null,null,null,null,null,null,"   "]
[null,null,null,null,"$","-","","",null,"-",0,"",null,null,null,null,null,null,null,null,null,"   "]
[null,null,null,null,"$","-","","",null,"-",0,"",null,null,null,null,null,null,null,null,null,"   "]
[null,null,null,null,"$","-","","",null,"-",0,"",null,null,null,null,null,null,null,null,null,"   "]
[null,null,null,null,"$","-","","",null,"-",0,"",null,null,null,null,null,null,null,null,null,"   "]
[null,null,null,null,"$","-","","",null,"-",0,"",null,null,null,null,null,null,null,null,null,"   "]
[null,null,null,null,"$","-","","",null,"-",0,"",null,null,null,null,null,null,null,null,null,"   "]
[null,null,null,null,"$","-","","",null,"-",0,"",null,null,null,null,null,null,null,null,null,"   "]
[null,null,null,null,"$",{"$f":"IFERROR(INDEX(A501,MATCH(E501&\"*\",A501,)),\"-\")","v":"-"},{"$f":"IF(F501=\"-\",\"\",LEFT(F501,6))","v":""},{"$f":"MID(F501,8,50)","v":""},"",{"$f":"IF(F501=\"-\",\"-\",LEFT(F501,6))","v":"-"},{"$f":"I501","v":""},{"$f":"IF(F501=\"-\",\"\",B501)","v":""},"",null,null,null,null,null,null,null,null,"   "]
[null,null,null,null,"$","-","","","","-","","","",null,null,null,null,null,null,null,null,"   "]
[null,null,null,null,"$","-","","","","-","","","",null,null,null,null,null,null,null,null,"   "]
[null,null,null,null,"$","-","","","","-","","","",null,null,null,null,null,null,null,null,"   "]
[null,null,null,null,"$","-","","","","-","","","",null,null,null,null,null,null,null,null,"   "]
[null,null,null,null,"$","-","","","","-","","","",null,null,null,null,null,null,null,null,"   "]
[null,null,null,null,"$","-","","","","-","","","",null,null,null,null,null,null,null,null,"   "]
[null,null,null,null,"$","-","","","","-","","","",null,null,null,null,null,null,null,null,"   "]
[null,null,null,null,"$","-","","","","-","","","",null,null,null,null,null,null,null,null,"   "]
[null,null,null,null,"$","-","","","","-","","","",null,null,null,null,null,null,null,null,"   "]
[null,null,null,null,"$","-","","","","-","","","",null,null,null,null,null,null,null,null,"   "]
[null,null,null,null,"$","-","","","","-","","","",null,null,null,null,null,null,null,null,"   "]
[null,null,null,null,"$","-","","","","-","","","",null,null,null,null,null,null,null,null,"   "]
[null,null,null,null,"$","-","","","","-","","","",null,null,null,null,null,null,null,null,"   "]
[null,null,null,null,"$","-","","","","-","","","",null,null,null,null,null,null,null,null,"   "]
[null,null,null,null,"$","-","","","","-","","","",null,null,null,null,null,null,null,null,"   "]
[null,null,null,null,"$","-","","","","-","","","",null,null,null,null,null,null,null,null,"   "]
[null,null,null,null,"$","-","","","","-","","","",null,null,null,null,null,null,null,null,{"$f":"CONCATENATE(A518,\" \",B518,\" \",C518,\" \",D518)","v":"   "}]
[null,null,null,null,"$","-","","","","-","","","",null,null,null,null,null,null,null,null,"   "]
[null,null,null,null,"$","-","","","","-","","","",null,null,null,null,null,null,null,null,"   "]
[null,null,null,null,"$","-","","","","-","","","",null,null,null,null,null,null,null,null,"   "]
[null,null,null,null,"$","-","","","","-","","","",null,null,null,null,null,null,null,null,"   "]
[null,null,null,null,"$","-","","","","-","","","",null,null,null,null,null,null,null,null,"   "]
[null,null,null,null,"$","-","","","","-","","","",null,null,null,null,null,null,null,null,"   "]
[null,null,null,null,"$","-","","","","-","","","",null,null,null,null,null,null,null,null,"   "]
[null,null,null,null,"$","-","","","","-","","","",null,null,null,null,null,null,null,null,"   "]
[null,null,null,null,"$","-","","","","-","","","",null,null,null,null,null,null,null,null,"   "]
[null,null,null,null,"$","-","","","","-","","","",null,null,null,null,null,null,null,null,"   "]
[null,null,null,null,"$","-","","","","-","","","",null,null,null,null,null,null,null,null,"   "]
[null,null,null,null,"$","-","","","","-","","","",null,null,null,null,null,null,null,null,"   "]
[null,null,null,null,"$","-","","","","-","","","",null,null,null,null,null,null,null,null,"   "]
[null,null,null,null,"$","-","","","","-","","","",null,null,null,null,null,null,null,null,"   "]
[null,null,null,null,"$","-","","","","-","","","",null,null,null,null,null,null,null,null,"   "]
[null,null,null,null,"$","-","","","","-","","","",null,null,null,null,null,null,null,null,"   "]
[null,null,null,null,"$","-","","","","-","","","",null,null,null,null,null,null,null,null,"   "]
[null,null,null,null,"$","-","","","","-","","","",null,null,null,null,null,null,null,null,"   "]
[null,null,null,null,"$","-","","","","-","","","",null,null,null,null,null,null,null,null,"   "]
[null,null,null,null,"$","-","","","","-","","","",null,null,null,null,null,null,null,null,"   "]
[null,null,null,null,"$","-","","","","-","","","",null,null,null,null,null,null,null,null,"   "]
[null,null,null,null,"$","-","","","","-","","","",null,null,null,null,null,null,null,null,"   "]
[null,null,null,null,"$","-","","","","-","","","",null,null,null,null,null,null,null,null,"   "]
[null,null,null,null,"$","-","","","","-","","","",null,null,null,null,null,null,null,null,"   "]
[null,null,null,null,"$","-","","","","-","","","",null,null,null,null,null,null,null,null,"   "]
[null,null,null,null,"$","-","","","","-","","","",null,null,null,null,null,null,null,null,"   "]
[null,null,null,null,"$","-","","","","-","","","",null,null,null,null,null,null,null,null,"   "]
[null,null,null,null,"$","-","","","","-","","","",null,null,null,null,null,null,null,null,"   "]
[null,null,null,null,"$","-","","","","-","","","",null,null,null,null,null,null,null,null,"   "]
[null,null,null,null,"$","-","","","","-","","","",null,null,null,null,null,null,null,null,"   "]
[null,null,null,null,"$","-","","","","-","","","",null,null,null,null,null,null,null,null,"   "]
[null,null,null,null,"$","-","","","","-","","","",null,null,null,null,null,null,null,null,"   "]
[null,null,null,null,"$","-","","","","-","","","",null,null,null,null,null,null,null,null,"   "]
[null,null,null,null,"$","-","","","","-","","","",null,null,null,null,null,null,null,null,"   "]
[null,null,null,null,"$","-","","","","-","","","",null,null,null,null,null,null,null,null,"   "]
[null,null,null,null,"$","-","","","","-","","","",null,null,null,null,null,null,null,null,"   "]
[null,null,null,null,"$","-","","","","-","","","",null,null,null,null,null,null,null,null,"   "]
[null,null,null,null,"$","-","","","","-","","","",null,null,null,null,null,null,null,null,"   "]
[null,null,null,null,"$","-","","","","-","","","",null,null,null,null,null,null,null,null,"   "]
[null,null,null,null,"$","-","","","","-","","","",null,null,null,null,null,null,null,null,"   "]
[null,null,null,null,"$","-","","","","-","","","",null,null,null,null,null,null,null,null,"   "]
[null,null,null,null,"$","-","","","","-","","","",null,null,null,null,null,null,null,null,"   "]
[null,null,null,null,"$","-","","","","-","","","",null,null,null,null,null,null,null,null,"   "]
[null,null,null,null,"$","-","","","","-","","","",null,null,null,null,null,null,null,null,"   "]
[null,null,null,null,"$","-","","","","-","","","",null,null,null,null,null,null,null,null,"   "]
[null,null,null,null,"$","-","","","","-","","","",null,null,null,null,null,null,null,null,"   "]
[null,null,null,null,"$",{"$f":"IFERROR(INDEX(A565,MATCH(E565&\"*\",A565,)),\"-\")","v":"-"},{"$f":"IF(F565=\"-\",\"\",LEFT(F565,6))","v":""},{"$f":"MID(F565,8,50)","v":""},"",{"$f":"IF(F565=\"-\",\"-\",LEFT(F565,6))","v":"-"},{"$f":"I565","v":""},{"$f":"IF(F565=\"-\",\"\",B565)","v":""},"",null,null,null,null,null,null,null,null,"   "]
[null,null,null,null,"$","-","","","","-","","","",null,null,null,null,null,null,null,null,"   "]
[null,null,null,null,"$","-","","","","-","","","",null,null,null,null,null,null,null,null,"   "]
[null,null,null,null,"$","-","","","","-","","","",null,null,null,null,null,null,null,null,"   "]
[null,null,null,null,"$","-","","","","-","","","",null,null,null,null,null,null,null,null,"   "]
[null,null,null,null,"$","-","","","","-","","","",null,null,null,null,null,null,null,null,"   "]
[null,null,null,null,"$","-","","","","-","","","",null,null,null,null,null,null,null,null,"   "]
[null,null,null,null,"$","-","","","","-","","","",null,null,null,null,null,null,null,null,"   "]
[null,null,null,null,"$","-","","","","-","","","",null,null,null,null,null,null,null,null,"   "]
[null,null,null,null,"$","-","","","","-","","","",null,null,null,null,null,null,null,null,"   "]
[null,null,null,null,"$","-","","","","-","","","",null,null,null,null,null,null,null,null,"   "]
[null,null,null,null,"$","-","","","","-","","","",null,null,null,null,null,null,null,null,"   "]
[null,null,null,null,"$","-","","","","-","","","",null,null,null,null,null,null,null,null,"   "]
[null,null,null,null,"$","-","","","","-","","","",null,null,null,null,null,null,null,null,"   "]
[null,null,null,null,"$","-","","","","-","","","",null,null,null,null,null,null,null,null,"   "]
[null,null,null,null,"$","-","","","","-","","","",null,null,null,null,null,null,null,null,"   "]
[null,null,null,null,"$","-","","","","-","","","",null,null,null,null,null,null,null,null,"   "]
[null,null,null,null,"$","-","","","","-","","","",null,null,null,null,null,null,null,null,{"$f":"CONCATENATE(A582,\" \",B582,\" \",C582,\" \",D582)","v":"   "}]
[null,null,null,null,"$","-","","","","-","","","",null,null,null,null,null,null,null,null,"   "]
[null,null,null,null,"$","-","","","","-","","","",null,null,null,null,null,null,null,null,"   "]
[null,null,null,null,"$","-","","","","-","","","",null,null,null,null,null,null,null,null,"   "]
[null,null,null,null,"$","-","","","","-","","","",null,null,null,null,null,null,null,null,"   "]
[null,null,null,null,"$","-","","","","-","","","",null,null,null,null,null,null,null,null,"   "]
[null,null,null,null,"$","-","","","","-","","","",null,null,null,null,null,null,null,null,"   "]
[null,null,null,null,"$","-","","","","-","","","",null,null,null,null,null,null,null,null,"   "]
[null,null,null,null,"$","-","","","","-","","","",null,null,null,null,null,null,null,null,"   "]
[null,null,null,null,"$","-","","","","-","","","",null,null,null,null,null,null,null,null,"   "]
[null,null,null,null,"$","-","","","","-","","","",null,null,null,null,null,null,null,null,"   "]
[null,null,null,null,"$","-","","","","-","","","",null,null,null,null,null,null,null,null,"   "]
[null,null,null,null,"$","-","","","","-","","","",null,null,null,null,null,null,null,null,"   "]
[null,null,null,null,"$","-","","","","-","","","",null,null,null,null,null,null,null,null,"   "]
[null,null,null,null,"$","-","","","","-","","","",null,null,null,null,null,null,null,null,"   "]
[null,null,null,null,"$","-","","","","-","","","",null,null,null,null,null,null,null,null,"   "]
[null,null,null,null,"$","-","","","","-","","","",null,null,null,null,null,null,null,null,"   "]
[null,null,null,null,"$","-","","","","-","","","",null,null,null,null,null,null,null,null,"   "]
[null,null,null,null,"$","-","","","","-","","","",null,null,null,null,null,null,null,null,"   "]
[null,null,null,null,"$","-","","","","-","","","",null,null,null,null,null,null,null,null,"   "]
[null,null,null,null,"$","-","","","","-","","","",null,null,null,null,null,null,null,null,"   "]
[null,null,null,null,"$","-","","","","-","","","",null,null,null,null,null,null,null,null,"   "]
[null,null,null,null,"$","-","","","","-","","","",null,null,null,null,null,null,null,null,"   "]
[null,null,null,null,"$","-","","","","-","","","",null,null,null,null,null,null,null,null,"   "]
[null,null,null,null,"$","-","","","","-","","","",null,null,null,null,null,null,null,null,"   "]
[null,null,null,null,"$","-","","","","-","","","",null,null,null,null,null,null,null,null,"   "]
[null,null,null,null,"$","-","","","","-","","","",null,null,null,null,null,null,null,null,"   "]
[null,null,null,null,"$","-","","","","-","","","",null,null,null,null,null,null,null,null,"   "]
[null,null,null,null,"$","-","","","","-","","","",null,null,null,null,null,null,null,null,"   "]
[null,null,null,null,"$","-","","","","-","","","",null,null,null,null,null,null,null,null,"   "]
[null,null,null,null,"$","-","","","","-","","","",null,null,null,null,null,null,null,null,"   "]
[null,null,null,null,"$","-","","","","-","","","",null,null,null,null,null,null,null,null,"   "]
[null,null,null,null,"$","-","","","","-","","","",null,null,null,null,null,null,null,null,"   "]
[null,null,null,null,"$","-","","","","-","","","",null,null,null,null,null,null,null,null,"   "]
[null,null,null,null,"$","-","","","","-","","","",null,null,null,null,null,null,null,null,"   "]
[null,null,null,null,"$","-","","","","-","","","",null,null,null,null,null,null,null,null,"   "]
[null,null,null,null,"$","-","","","","-","","","",null,null,null,null,null,null,null,null,"   "]
[null,null,null,null,"$","-","","","","-","","","",null,null,null,null,null,null,null,null,"   "]
[null,null,null,null,"$","-","","","","-","","","",null,null,null,null,null,null,null,null,"   "]
[null,null,null,null,"$","-","","","","-","","","",null,null,null,null,null,null,null,null,"   "]
[null,null,null,null,"$","-","","","","-","","","",null,null,null,null,null,null,null,null,"   "]
[null,null,null,null,"$","-","","","","-","","","",null,null,null,null,null,null,null,null,"   "]
[null,null,null,null,"$","-","","","","-","","","",null,null,null,null,null,null,null,null,"   "]
[null,null,null,null,"$","-","","","","-","","","",null,null,null,null,null,null,null,null,"   "]
[null,null,null,null,"$","-","","","","-","","","",null,null,null,null,null,null,null,null,"   "]
[null,null,null,null,"$","-","","","","-","","","",null,null,null,null,null,null,null,null,"   "]
[null,null,null,null,"$","-","","","","-","","","",null,null,null,null,null,null,null,null,"   "]
[null,null,null,null,"$",{"$f":"IFERROR(INDEX(A629,MATCH(E629&\"*\",A629,)),\"-\")","v":"-"},{"$f":"IF(F629=\"-\",\"\",LEFT(F629,6))","v":""},{"$f":"MID(F629,8,50)","v":""},"",{"$f":"IF(F629=\"-\",\"-\",LEFT(F629,6))","v":"-"},{"$f":"I629","v":""},{"$f":"IF(F629=\"-\",\"\",B629)","v":""},"",null,null,null,null,null,null,null,null,"   "]
[null,null,null,null,"$","-","","","","-","","","",null,null,null,null,null,null,null,null,"   "]
[null,null,null,null,"$","-","","","","-","","","",null,null,null,null,null,null,null,null,"   "]
[null,null,null,null,"$","-","","","","-","","","",null,null,null,null,null,null,null,null,"   "]
[null,null,null,null,"$","-","","","","-","","","",null,null,null,null,null,null,null,null,"   "]
[null,null,null,null,"$","-","","","","-","","","",null,null,null,null,null,null,null,null,"   "]
[null,null,null,null,"$","-","","","","-","","","",null,null,null,null,null,null,null,null,"   "]
[null,null,null,null,"$","-","","","","-","","","",null,null,null,null,null,null,null,null,"   "]
[null,null,null,null,"$","-","","","","-","","","",null,null,null,null,null,null,null,null,"   "]
[null,null,null,null,"$","-","","","","-","","","",null,null,null,null,null,null,null,null,"   "]
[null,null,null,null,"$","-","","","","-","","","",null,null,null,null,null,null,null,null,"   "]
[null,null,null,null,"$","-","","","","-","","","",null,null,null,null,null,null,null,null,"   "]
[null,null,null,null,"$","-","","","","-","","","",null,null,null,null,null,null,null,null,"   "]
[null,null,null,null,"$","-","","","","-","","","",null,null,null,null,null,null,null,null,"   "]
[null,null,null,null,"$","-","","","","-","","","",null,null,null,null,null,null,null,null,"   "]
[null,null,null,null,"$","-","","","","-","","","",null,null,null,null,null,null,null,null,"   "]
[null,null,null,null,"$","-","","","","-","","","",null,null,null,null,null,null,null,null,"   "]
[null,null,null,null,"$","-","","","","-","","","",null,null,null,null,null,null,null,null,{"$f":"CONCATENATE(A646,\" \",B646,\" \",C646,\" \",D646)","v":"   "}]
[null,null,null,null,"$","-","","","","-","","","",null,null,null,null,null,null,null,null,"   "]
[null,null,null,null,"$","-","","","","-","","","",null,null,null,null,null,null,null,null,"   "]
[null,null,null,null,"$","-","","","","-","","","",null,null,null,null,null,null,null,null,"   "]
[null,null,null,null,"$","-","","","","-","","","",null,null,null,null,null,null,null,null,"   "]
[null,null,null,null,"$","-","","","","-","","","",null,null,null,null,null,null,null,null,"   "]
[null,null,null,null,"$","-","","","","-","","","",null,null,null,null,null,null,null,null,"   "]
[null,null,null,null,"$","-","","","","-","","","",null,null,null,null,null,null,null,null,"   "]
[null,null,null,null,"$","-","","","","-","","","",null,null,null,null,null,null,null,null,"   "]
[null,null,null,null,"$","-","","","","-","","","",null,null,null,null,null,null,null,null,"   "]
[null,null,null,null,"$","-","","","","-","","","",null,null,null,null,null,null,null,null,"   "]
[null,null,null,null,"$","-","","","","-","","","",null,null,null,null,null,null,null,null,"   "]
[null,null,null,null,"$","-","","","","-","","","",null,null,null,null,null,null,null,null,"   "]
[null,null,null,null,"$","-","","","","-","","","",null,null,null,null,null,null,null,null,"   "]
[null,null,null,null,"$","-","","","","-","","","",null,null,null,null,null,null,null,null,"   "]
[null,null,null,null,"$","-","","","","-","","","",null,null,null,null,null,null,null,null,"   "]
[null,null,null,null,"$","-","","","","-","","","",null,null,null,null,null,null,null,null,"   "]
[null,null,null,null,"$","-","","","","-","","","",null,null,null,null,null,null,null,null,"   "]
[null,null,null,null,"$","-","","","","-","","","",null,null,null,null,null,null,null,null,"   "]
[null,null,null,null,"$","-","","","","-","","","",null,null,null,null,null,null,null,null,"   "]
[null,null,null,null,"$","-","","","","-","","","",null,null,null,null,null,null,null,null,"   "]
[null,null,null,null,"$","-","","","","-","","","",null,null,null,null,null,null,null,null,"   "]
[null,null,null,null,"$","-","","","","-","","","",null,null,null,null,null,null,null,null,"   "]
[null,null,null,null,"$","-","","","","-","","","",null,null,null,null,null,null,null,null,"   "]
[null,null,null,null,"$","-","","","","-","","","",null,null,null,null,null,null,null,null,"   "]
[null,null,null,null,"$","-","","","","-","","","",null,null,null,null,null,null,null,null,"   "]
[null,null,null,null,"$","-","","","","-","","","",null,null,null,null,null,null,null,null,"   "]
[null,null,null,null,"$","-","","","","-","","","",null,null,null,null,null,null,null,null,"   "]
[null,null,null,null,"$","-","","","","-","","","",null,null,null,null,null,null,null,null,"   "]
[null,null,null,null,"$","-","","","","-","","","",null,null,null,null,null,null,null,null,"   "]
[null,null,null,null,"$","-","","","","-","","","",null,null,null,null,null,null,null,null,"   "]
[null,null,null,null,"$","-","","","","-","","","",null,null,null,null,null,null,null,null,"   "]
[null,null,null,null,"$","-","","","","-","","","",null,null,null,null,null,null,null,null,"   "]
[null,null,null,null,"$","-","","","","-","","","",null,null,null,null,null,null,null,null,"   "]
[null,null,null,null,"$","-","","","","-","","","",null,null,null,null,null,null,null,null,"   "]
[null,null,null,null,"$","-","","","","-","","","",null,null,null,null,null,null,null,null,"   "]
[null,null,null,null,"$","-","","","","-","","","",null,null,null,null,null,null,null,null,"   "]
[null,null,null,null,"$","-","","","","-","","","",null,null,null,null,null,null,null,null,"   "]
[null,null,null,null,"$","-","","","","-","","","",null,null,null,null,null,null,null,null,"   "]
[null,null,null,null,"$","-","","","","-","","","",null,null,null,null,null,null,null,null,"   "]
[null,null,null,null,"$","-","","","","-","","","",null,null,null,null,null,null,null,null,"   "]
[null,null,null,null,"$","-","","","","-","","","",null,null,null,null,null,null,null,null,"   "]
[null,null,null,null,"$","-","","","","-","","","",null,null,null,null,null,null,null,null,"   "]
[null,null,null,null,"$","-","","","","-","","","",null,null,null,null,null,null,null,null,"   "]
[null,null,null,null,"$","-","","","","-","","","",null,null,null,null,null,null,null,null,"   "]
[null,null,null,null,"$","-","","","","-","","","",null,null,null,null,null,null,null,null,"   "]
[null,null,null,null,"$","-","","","","-","","","",null,null,null,null,null,null,null,null,"   "]
[null,null,null,null,"$",{"$f":"IFERROR(INDEX(A693,MATCH(E693&\"*\",A693,)),\"-\")","v":"-"},{"$f":"IF(F693=\"-\",\"\",LEFT(F693,6))","v":""},{"$f":"MID(F693,8,50)","v":""},"",{"$f":"IF(F693=\"-\",\"-\",LEFT(F693,6))","v":"-"},{"$f":"I693","v":""},{"$f":"IF(F693=\"-\",\"\",B693)","v":""},"",null,null,null,null,null,null,null,null,"   "]
[null,null,null,null,"$","-","","","","-","","","",null,null,null,null,null,null,null,null,"   "]
[null,null,null,null,"$","-","","","","-","","","",null,null,null,null,null,null,null,null,"   "]
[null,null,null,null,"$","-","","","","-","","","",null,null,null,null,null,null,null,null,"   "]
[null,null,null,null,"$","-","","","","-","","","",null,null,null,null,null,null,null,null,"   "]
[null,null,null,null,"$","-","","","","-","","","",null,null,null,null,null,null,null,null,"   "]
[null,null,null,null,"$","-","","","","-","","","",null,null,null,null,null,null,null,null,"   "]
[null,null,null,null,"$","-","","","","-","","","",null,null,null,null,null,null,null,null,"   "]

{"sheet":"Wage and Name","index":1,"n_rows":1,"n_cols":3,"rows_kept":1,"cut":false,"hidden":false,"merged":[]}
["#","Wage","First Name"]

{"sheet":"Filtered Information","index":2,"n_rows":82,"n_cols":23,"rows_kept":82,"cut":false,"hidden":false,"merged":[]}
["Number of slots required",{"$f":"MAX(A3:A66)","v":0},"Date value",{"$f":"DATEVALUE(O1)","v":"2013-10-28"},null,null,null,null,null,null,null,null,null,null,{"$f":"CONCATENATE(T1,\"/\",P1,\"/\",W1)","v":"28/10/2013"},{"$f":"SUM(P3:P14)","v":10},null,null,null,{"$f":"SUM(T3:T82)","v":28},null,null,{"$f":"SUM(W3:W9)","v":2013}]
["#","Wage","First Name","Last Name","Position",null,null,null,null,null,null,null,null,null,"Month","Month #","Day","YES/NO",null,"Date","Year","YES/NO","Year"]
[{"$f":"IF(ISBLANK(B3),\"-\",1)","v":"-"},null,null,null,null,null,null,null,null,null,null,null,null,null,"January",{"$f":"IFERROR(IF(FIND(O3,'PDF Information'!$F$9)>0,1,\"\"),\"\")","v":""},1,{"$f":"IFERROR(IF(FIND(\" 1 \",'PDF Information'!$F$9)>0,1,\"\"),\"\")","v":""},null,{"$f":"IF(R3=\"\",\"\",Q3*R3)","v":""},2013,{"$f":"IFERROR(IF(FIND(U3,'PDF Information'!$F$9)>0,1,\"\"),\"\")","v":1},{"$f":"IF(V3=\"\",\"\",V3*U3)","v":2013}]
[{"$f":"IF(ISBLANK(B4),\"\",A3+1)","v":""},null,null,null,null,null,null,null,null,null,null,null,null,null,"February",{"$f":"IFERROR(IF(FIND(O4,'PDF Information'!$F$9)>0,2,\"\"),\"\")","v":""},2,{"$f":"IFERROR(IF(FIND(\" 2 \",'PDF Information'!$F$9)>0,1,\"\"),\"\")","v":""},null,"",2014,{"$f":"IFERROR(IF(FIND(U4,'PDF Information'!$F$9)>0,1,\"\"),\"\")","v":""},{"$f":"IF(V4=\"\",\"\",V4*U4)","v":""}]
[{"$f":"IF(ISBLANK(B5),\"\",A4+1)","v":""},null,null,null,null,null,null,null,null,null,null,null,null,null,"March",{"$f":"IFERROR(IF(FIND(O5,'PDF Information'!$F$9)>0,3,\"\"),\"\")","v":""},3,{"$f":"IFERROR(IF(FIND(\" 3 \",'PDF Information'!$F$9)>0,1,\"\"),\"\")","v":""},null,"",2015,{"$f":"IFERROR(IF(FIND(U5,'PDF Information'!$F$9)>0,1,\"\"),\"\")","v":""},{"$f":"IF(V5=\"\",\"\",V5*U5)","v":""}]
["",null,null,null,null,null,null,null,null,null,null,null,null,null,"April",{"$f":"IFERROR(IF(FIND(O6,'PDF Information'!$F$9)>0,4,\"\"),\"\")","v":""},4,{"$f":"IFERROR(IF(FIND(\" 4 \",'PDF Information'!$F$9)>0,1,\"\"),\"\")","v":""},null,"",2016,{"$f":"IFERROR(IF(FIND(U6,'PDF Information'!$F$9)>0,1,\"\"),\"\")","v":""},""]
["",null,null,null,null,null,null,null,null,null,null,null,null,null,"May",{"$f":"IFERROR(IF(FIND(O7,'PDF Information'!$F$9)>0,5,\"\"),\"\")","v":""},5,{"$f":"IFERROR(IF(FIND(\" 5 \",'PDF Information'!$F$9)>0,1,\"\"),\"\")","v":""},null,"",2017,{"$f":"IFERROR(IF(FIND(U7,'PDF Information'!$F$9)>0,1,\"\"),\"\")","v":""},""]
["",null,null,null,null,null,null,null,null,null,null,null,null,null,"June",{"$f":"IFERROR(IF(FIND(O8,'PDF Information'!$F$9)>0,6,\"\"),\"\")","v":""},6,{"$f":"IFERROR(IF(FIND(\" 6 \",'PDF Information'!$F$9)>0,1,\"\"),\"\")","v":""},null,"",2018,{"$f":"IFERROR(IF(FIND(U8,'PDF Information'!$F$9)>0,1,\"\"),\"\")","v":""},""]
["",null,null,null,null,null,null,null,null,null,null,null,null,null,"July",{"$f":"IFERROR(IF(FIND(O9,'PDF Information'!$F$9)>0,7,\"\"),\"\")","v":""},7,{"$f":"IFERROR(IF(FIND(\" 7 \",'PDF Information'!$F$9)>0,1,\"\"),\"\")","v":""},null,"",2019,{"$f":"IFERROR(IF(FIND(U9,'PDF Information'!$F$9)>0,1,\"\"),\"\")","v":""},""]
["",null,null,null,null,null,null,null,null,null,null,null,null,null,"August",{"$f":"IFERROR(IF(FIND(O10,'PDF Information'!$F$9)>0,8,\"\"),\"\")","v":""},8,{"$f":"IFERROR(IF(FIND(\" 8 \",'PDF Information'!$F$9)>0,1,\"\"),\"\")","v":""},null,"",2020,{"$f":"IFERROR(IF(FIND(U10,'PDF Information'!$F$9)>0,1,\"\"),\"\")","v":""},""]
["",null,null,null,null,null,null,null,null,null,null,null,null,null,"September",{"$f":"IFERROR(IF(FIND(O11,'PDF Information'!$F$9)>0,9,\"\"),\"\")","v":""},9,{"$f":"IFERROR(IF(FIND(\" 9 \",'PDF Information'!$F$9)>0,1,\"\"),\"\")","v":""},null,""]
["",null,null,null,null,null,null,null,null,null,null,null,null,null,"October",{"$f":"IFERROR(IF(FIND(O12,'PDF Information'!$F$9)>0,10,\"\"),\"\")","v":10},10,{"$f":"IFERROR(IF(FIND(\" 10 \",'PDF Information'!$F$9)>0,1,\"\"),\"\")","v":""},null,""]
["",null,null,null,null,null,null,null,null,null,null,null,null,null,"November",{"$f":"IFERROR(IF(FIND(O13,'PDF Information'!$F$9)>0,11,\"\"),\"\")","v":""},11,{"$f":"IFERROR(IF(FIND(\" 11 \",'PDF Information'!$F$9)>0,1,\"\"),\"\")","v":""},null,""]
["",null,null,null,null,null,null,null,null,null,null,null,null,null,"December",{"$f":"IFERROR(IF(FIND(O14,'PDF Information'!$F$9)>0,12,\"\"),\"\")","v":""},12,{"$f":"IFERROR(IF(FIND(\" 12 \",'PDF Information'!$F$9)>0,1,\"\"),\"\")","v":""},null,""]
["",null,null,null,null,null,null,null,null,null,null,null,null,null,null,null,13,{"$f":"IFERROR(IF(FIND(\" 13 \",'PDF Information'!$F$9)>0,1,\"\"),\"\")","v":""},null,""]
["",null,null,null,null,null,null,null,null,null,null,null,null,null,null,null,14,{"$f":"IFERROR(IF(FIND(\" 14 \",'PDF Information'!$F$9)>0,1,\"\"),\"\")","v":""},null,""]
["",null,null,null,null,null,null,null,null,null,null,null,null,null,null,null,15,{"$f":"IFERROR(IF(FIND(\" 15 \",'PDF Information'!$F$9)>0,1,\"\"),\"\")","v":""},null,""]
["",null,null,null,null,null,null,null,null,null,null,null,null,null,null,null,16,{"$f":"IFERROR(IF(FIND(\" 16 \",'PDF Information'!$F$9)>0,1,\"\"),\"\")","v":""},null,""]
["",null,null,null,null,null,null,null,null,null,null,null,null,null,null,null,17,{"$f":"IFERROR(IF(FIND(\" 17 \",'PDF Information'!$F$9)>0,1,\"\"),\"\")","v":""},null,""]
["",null,null,null,null,null,null,null,null,null,null,null,null,null,null,null,18,{"$f":"IFERROR(IF(FIND(\" 18 \",'PDF Information'!$F$9)>0,1,\"\"),\"\")","v":""},null,""]
["",null,null,null,null,null,null,null,null,null,null,null,null,null,null,null,19,{"$f":"IFERROR(IF(FIND(\" 19 \",'PDF Information'!$F$9)>0,1,\"\"),\"\")","v":""},null,""]
["",null,null,null,null,null,null,null,null,null,null,null,null,null,null,null,20,{"$f":"IFERROR(IF(FIND(\" 20 \",'PDF Information'!$F$9)>0,1,\"\"),\"\")","v":""},null,""]
["",null,null,null,null,null,null,null,null,null,null,null,null,null,null,null,21,{"$f":"IFERROR(IF(FIND(\" 21 \",'PDF Information'!$F$9)>0,1,\"\"),\"\")","v":""},null,""]
["",null,null,null,null,null,null,null,null,null,null,null,null,null,null,null,22,{"$f":"IFERROR(IF(FIND(\" 22 \",'PDF Information'!$F$9)>0,1,\"\"),\"\")","v":""},null,""]
["",null,null,null,null,null,null,null,null,null,null,null,null,null,null,null,23,{"$f":"IFERROR(IF(FIND(\" 23 \",'PDF Information'!$F$9)>0,1,\"\"),\"\")","v":""},null,""]
["",null,null,null,null,null,null,null,null,null,null,null,null,null,null,null,24,{"$f":"IFERROR(IF(FIND(\" 24 \",'PDF Information'!$F$9)>0,1,\"\"),\"\")","v":""},null,""]
["",null,null,null,null,null,null,null,null,null,null,null,null,null,null,null,25,{"$f":"IFERROR(IF(FIND(\" 25 \",'PDF Information'!$F$9)>0,1,\"\"),\"\")","v":""},null,""]
["",null,null,null,null,null,null,null,null,null,null,null,null,null,null,null,26,{"$f":"IFERROR(IF(FIND(\" 26 \",'PDF Information'!$F$9)>0,1,\"\"),\"\")","v":""},null,""]
["",null,null,null,null,null,null,null,null,null,null,null,null,null,null,null,27,{"$f":"IFERROR(IF(FIND(\" 27 \",'PDF Information'!$F$9)>0,1,\"\"),\"\")","v":""},null,""]
["",null,null,null,null,null,null,null,null,null,null,null,null,null,null,null,28,{"$f":"IFERROR(IF(FIND(\" 28 \",'PDF Information'!$F$9)>0,1,\"\"),\"\")","v":""},null,""]
["",null,null,null,null,null,null,null,null,null,null,null,null,null,null,null,29,{"$f":"IFERROR(IF(FIND(\" 29 \",'PDF Information'!$F$9)>0,1,\"\"),\"\")","v":""},null,""]
["",null,null,null,null,null,null,null,null,null,null,null,null,null,null,null,30,{"$f":"IFERROR(IF(FIND(\" 30 \",'PDF Information'!$F$9)>0,1,\"\"),\"\")","v":""},null,""]
["",null,null,null,null,null,null,null,null,null,null,null,null,null,null,null,31,{"$f":"IFERROR(IF(FIND(\" 31 \",'PDF Information'!$F$9)>0,1,\"\"),\"\")","v":""},null,""]
["",null,null,null,null,null,null,null,null,null,null,null,null,null,null,null,"01",{"$f":"IFERROR(IF(FIND(\" 01 \",'PDF Information'!$F$9)>0,1,\"\"),\"\")","v":""},null,""]
["",null,null,null,null,null,null,null,null,null,null,null,null,null,null,null,"02",{"$f":"IFERROR(IF(FIND(\" 02 \",'PDF Information'!$F$9)>0,1,\"\"),\"\")","v":""},null,""]
["",null,null,null,null,null,null,null,null,null,null,null,null,null,null,null,"03",{"$f":"IFERROR(IF(FIND(\" 03 \",'PDF Information'!$F$9)>0,1,\"\"),\"\")","v":""},null,""]
["",null,null,null,null,null,null,null,null,null,null,null,null,null,null,null,"04",{"$f":"IFERROR(IF(FIND(\" 04 \",'PDF Information'!$F$9)>0,1,\"\"),\"\")","v":""},null,""]
["",null,null,null,null,null,null,null,null,null,null,null,null,null,null,null,"05",{"$f":"IFERROR(IF(FIND(\" 05 \",'PDF Information'!$F$9)>0,1,\"\"),\"\")","v":""},null,""]
["",null,null,null,null,null,null,null,null,null,null,null,null,null,null,null,"06",{"$f":"IFERROR(IF(FIND(\" 06 \",'PDF Information'!$F$9)>0,1,\"\"),\"\")","v":""},null,""]
["",null,null,null,null,null,null,null,null,null,null,null,null,null,null,null,"07",{"$f":"IFERROR(IF(FIND(\" 07 \",'PDF Information'!$F$9)>0,1,\"\"),\"\")","v":""},null,""]
["",null,null,null,null,null,null,null,null,null,null,null,null,null,null,null,"08",{"$f":"IFERROR(IF(FIND(\" 08 \",'PDF Information'!$F$9)>0,1,\"\"),\"\")","v":""},null,""]
["",null,null,null,null,null,null,null,null,null,null,null,null,null,null,null,"09",{"$f":"IFERROR(IF(FIND(\" 09 \",'PDF Information'!$F$9)>0,1,\"\"),\"\")","v":""},null,""]
["",null,null,null,null,null,null,null,null,null,null,null,null,null,null,null,"1,",{"$f":"IFERROR(IF(FIND(\" 1, \",'PDF Information'!$F$9)>0,1,\"\"),\"\")","v":""},1,{"$f":"IF(R43=\"\",\"\",S43*R43)","v":""}]
["",null,null,null,null,null,null,null,null,null,null,null,null,null,null,null,"2,",{"$f":"IFERROR(IF(FIND(\" 2, \",'PDF Information'!$F$9)>0,1,\"\"),\"\")","v":""},2,{"$f":"IF(R44=\"\",\"\",S44*R44)","v":""}]
["",null,null,null,null,null,null,null,null,null,null,null,null,null,null,null,"3,",{"$f":"IFERROR(IF(FIND(\" 3, \",'PDF Information'!$F$9)>0,1,\"\"),\"\")","v":""},3,""]
["",null,null,null,null,null,null,null,null,null,null,null,null,null,null,null,"4,",{"$f":"IFERROR(IF(FIND(\" 4, \",'PDF Information'!$F$9)>0,1,\"\"),\"\")","v":""},4,""]
["",null,null,null,null,null,null,null,null,null,null,null,null,null,null,null,"5,",{"$f":"IFERROR(IF(FIND(\" 5, \",'PDF Information'!$F$9)>0,1,\"\"),\"\")","v":""},5,""]
["",null,null,null,null,null,null,null,null,null,null,null,null,null,null,null,"6,",{"$f":"IFERROR(IF(FIND(\" 6, \",'PDF Information'!$F$9)>0,1,\"\"),\"\")","v":""},6,""]
["",null,null,null,null,null,null,null,null,null,null,null,null,null,null,null,"7,",{"$f":"IFERROR(IF(FIND(\" 7, \",'PDF Information'!$F$9)>0,1,\"\"),\"\")","v":""},7,""]
["",null,null,null,null,null,null,null,null,null,null,null,null,null,null,null,"8,",{"$f":"IFERROR(IF(FIND(\" 8, \",'PDF Information'!$F$9)>0,1,\"\"),\"\")","v":""},8,""]
["",null,null,null,null,null,null,null,null,null,null,null,null,null,null,null,"9,",{"$f":"IFERROR(IF(FIND(\" 9, \",'PDF Information'!$F$9)>0,1,\"\"),\"\")","v":""},9,""]
["",null,null,null,null,null,null,null,null,null,null,null,null,null,null,null,"10,",{"$f":"IFERROR(IF(FIND(\" 10, \",'PDF Information'!$F$9)>0,1,\"\"),\"\")","v":""},10,""]
["",null,null,null,null,null,null,null,null,null,null,null,null,null,null,null,"11,",{"$f":"IFERROR(IF(FIND(\" 11, \",'PDF Information'!$F$9)>0,1,\"\"),\"\")","v":""},11,""]
["",null,null,null,null,null,null,null,null,null,null,null,null,null,null,null,"12,",{"$f":"IFERROR(IF(FIND(\" 12, \",'PDF Information'!$F$9)>0,1,\"\"),\"\")","v":""},12,""]
["",null,null,null,null,null,null,null,null,null,null,null,null,null,null,null,"13,",{"$f":"IFERROR(IF(FIND(\" 13, \",'PDF Information'!$F$9)>0,1,\"\"),\"\")","v":""},13,""]
["",null,null,null,null,null,null,null,null,null,null,null,null,null,null,null,"14,",{"$f":"IFERROR(IF(FIND(\" 14, \",'PDF Information'!$F$9)>0,1,\"\"),\"\")","v":""},14,""]
["",null,null,null,null,null,null,null,null,null,null,null,null,null,null,null,"15,",{"$f":"IFERROR(IF(FIND(\" 15, \",'PDF Information'!$F$9)>0,1,\"\"),\"\")","v":""},15,""]
["",null,null,null,null,null,null,null,null,null,null,null,null,null,null,null,"16,",{"$f":"IFERROR(IF(FIND(\" 16, \",'PDF Information'!$F$9)>0,1,\"\"),\"\")","v":""},16,""]
["",null,null,null,null,null,null,null,null,null,null,null,null,null,null,null,"17,",{"$f":"IFERROR(IF(FIND(\" 17, \",'PDF Information'!$F$9)>0,1,\"\"),\"\")","v":""},17,""]
["",null,null,null,null,null,null,null,null,null,null,null,null,null,null,null,"18,",{"$f":"IFERROR(IF(FIND(\" 18, \",'PDF Information'!$F$9)>0,1,\"\"),\"\")","v":""},18,""]
["",null,null,null,null,null,null,null,null,null,null,null,null,null,null,null,"19,",{"$f":"IFERROR(IF(FIND(\" 19, \",'PDF Information'!$F$9)>0,1,\"\"),\"\")","v":""},19,""]
[{"$f":"IF(ISBLANK(B62),\"\",A61+1)","v":""},null,null,null,null,null,null,null,null,null,null,null,null,null,null,null,"20,",{"$f":"IFERROR(IF(FIND(\" 20, \",'PDF Information'!$F$9)>0,1,\"\"),\"\")","v":""},20,""]
["",null,null,null,null,null,null,null,null,null,null,null,null,null,null,null,"21,",{"$f":"IFERROR(IF(FIND(\" 21, \",'PDF Information'!$F$9)>0,1,\"\"),\"\")","v":""},21,""]
["",null,null,null,null,null,null,null,null,null,null,null,null,null,null,null,"22,",{"$f":"IFERROR(IF(FIND(\" 22, \",'PDF Information'!$F$9)>0,1,\"\"),\"\")","v":""},22,""]
[{"$f":"IF(ISBLANK(B65),\"\",A64+1)","v":""},null,null,null,null,null,null,null,null,null,null,null,null,null,null,null,"23,",{"$f":"IFERROR(IF(FIND(\" 23, \",'PDF Information'!$F$9)>0,1,\"\"),\"\")","v":""},23,""]
["",null,null,null,null,null,null,null,null,null,null,null,null,null,null,null,"24,",{"$f":"IFERROR(IF(FIND(\" 24, \",'PDF Information'!$F$9)>0,1,\"\"),\"\")","v":""},24,""]
[null,null,null,null,null,null,null,null,null,null,null,null,null,null,null,null,"25,",{"$f":"IFERROR(IF(FIND(\" 25, \",'PDF Information'!$F$9)>0,1,\"\"),\"\")","v":""},25,""]
[null,null,null,null,null,null,null,null,null,null,null,null,null,null,null,null,"26,",{"$f":"IFERROR(IF(FIND(\" 26, \",'PDF Information'!$F$9)>0,1,\"\"),\"\")","v":""},26,""]
[null,null,null,null,null,null,null,null,null,null,null,null,null,null,null,null,"27,",{"$f":"IFERROR(IF(FIND(\" 27, \",'PDF Information'!$F$9)>0,1,\"\"),\"\")","v":""},27,""]
[null,null,null,null,null,null,null,null,null,null,null,null,null,null,null,null,"28,",{"$f":"IFERROR(IF(FIND(\" 28, \",'PDF Information'!$F$9)>0,1,\"\"),\"\")","v":1},28,28]
[null,null,null,null,null,null,null,null,null,null,null,null,null,null,null,null,"29,",{"$f":"IFERROR(IF(FIND(\" 29, \",'PDF Information'!$F$9)>0,1,\"\"),\"\")","v":""},29,""]
[null,null,null,null,null,null,null,null,null,null,null,null,null,null,null,null,"30,",{"$f":"IFERROR(IF(FIND(\" 30, \",'PDF Information'!$F$9)>0,1,\"\"),\"\")","v":""},30,""]
[null,null,null,null,null,null,null,null,null,null,null,null,null,null,null,null,"31,",{"$f":"IFERROR(IF(FIND(\" 31, \",'PDF Information'!$F$9)>0,1,\"\"),\"\")","v":""},31,""]
[null,null,null,null,null,null,null,null,null,null,null,null,null,null,null,null,"01,",{"$f":"IFERROR(IF(FIND(\" 01, \",'PDF Information'!$F$9)>0,1,\"\"),\"\")","v":""},"01",""]
[null,null,null,null,null,null,null,null,null,null,null,null,null,null,null,null,"02,",{"$f":"IFERROR(IF(FIND(\" 02, \",'PDF Information'!$F$9)>0,1,\"\"),\"\")","v":""},"02",""]
[null,null,null,null,null,null,null,null,null,null,null,null,null,null,null,null,"03,",{"$f":"IFERROR(IF(FIND(\" 03, \",'PDF Information'!$F$9)>0,1,\"\"),\"\")","v":""},"03",""]
[null,null,null,null,null,null,null,null,null,null,null,null,null,null,null,null,"04,",{"$f":"IFERROR(IF(FIND(\" 04, \",'PDF Information'!$F$9)>0,1,\"\"),\"\")","v":""},"04",""]
[null,null,null,null,null,null,null,null,null,null,null,null,null,null,null,null,"05,",{"$f":"IFERROR(IF(FIND(\" 05, \",'PDF Information'!$F$9)>0,1,\"\"),\"\")","v":""},"05",""]
[null,null,null,null,null,null,null,null,null,null,null,null,null,null,null,null,"06,",{"$f":"IFERROR(IF(FIND(\" 06, \",'PDF Information'!$F$9)>0,1,\"\"),\"\")","v":""},"06",""]
[null,null,null,null,null,null,null,null,null,null,null,null,null,null,null,null,"07,",{"$f":"IFERROR(IF(FIND(\" 07, \",'PDF Information'!$F$9)>0,1,\"\"),\"\")","v":""},"07",""]
[null,null,null,null,null,null,null,null,null,null,null,null,null,null,null,null,"08,",{"$f":"IFERROR(IF(FIND(\" 08, \",'PDF Information'!$F$9)>0,1,\"\"),\"\")","v":""},"08",""]
[null,null,null,null,null,null,null,null,null,null,null,null,null,null,null,null,"09,",{"$f":"IFERROR(IF(FIND(\" 09, \",'PDF Information'!$F$9)>0,1,\"\"),\"\")","v":""},"09",""]

{"sheet":"Payroll Sheet","index":3,"n_rows":336,"n_cols":43,"rows_kept":336,"cut":false,"hidden":false,"merged":[[331,37,335,37],[3,12,3,13],[4,12,4,13],[5,12,5,13]]}
[null,null,null,null,null,null,null,null,null,null,null,null,null,null,null,"Which Row to Hide",null,"rate:","reg","ot","dt","show",null,"reg","ot","dt","sh",null,"reg","ot","dt","sh"]
[null,null,null,null,null,null,null,null,"THEATRICAL STAGE EMPLOYEES LOCAL #16 I.A.T.S.E. PAYROLL SHEET",null,null,null,null,null,null,"NO",null,"head ",33.64,{"$f":"S2*1.5","v":50.46},{"$f":"S2*2","v":67.28},154.24,"foreman",22.95,null,null,null,"Cont Coord",27.3,{"$f":"AC2*1.5","v":40.950000000000003},{"$f":"AC2*2","v":54.6}]
[null,null,null,null,null,null,null,null,"415/441-6400",null,null,null,null,null,null,"NO",null,"extra",30.14,45.21,{"$f":"S3*2","v":60.28},129.43,"shop ex",20.350000000000001,null,null,null,"Asst Coord",25.4,{"$f":"AC3*1.5","v":38.099999999999994},{"$f":"AC3*2","v":50.8}]
[null,null,null,null,null,null,null,null,"240 SECOND ST. ",null,null,"JOB:",{"$f":"'PDF Information'!F4","v":""},null,null,"NO",null,"followspot",{"$f":"S3","v":30.14},45.21,{"$f":"S4*2","v":60.28},140.22,null,null,null,null,null,"Mechanic",23.5,{"$f":"AC4*1.5","v":35.25},{"$f":"AC4*2","v":47}]
[null,null,null,null,null,null,null,null,"SAN FRANCISCO, CA 94105",null,null,"LOCATION:",{"$f":"'PDF Information'!F8","v":""},null,null,"NO",null,"a/v",23.64,35.46,null,null,null,null,null,null,null,"Bench Hand",21.85,{"$f":"AC5*1.5","v":32.775000000000006},{"$f":"AC5*2","v":43.7}]
[0,null,null,null,null,null,null,null,null,null,null,"REPORT TO:",{"$f":"'PDF Information'!F7","v":""},null,null,"NO",null,"a/v stew",33.64,50.46,null,null,"yerba buena hse",24.34,{"$f":"X6*1.5","v":36.51},null,null,"General",19.399999999999999,{"$f":"AC6*1.5","v":29.099999999999998},{"$f":"AC6*2","v":38.799999999999997}]
[null,"COMPANY:",{"$f":"'PDF Information'!F5","v":""},null,null,null,null,null,null,null,null,"START DATE:",{"$f":"'Filtered Information'!D1","v":"2013-10-28"},null,null,"NO",null,"a/v camera",30.14,45.21,null,null,"yerba buena forum",19.739999999999998,{"$f":"X7*1.5","v":29.61}]
[null,"PAYROLL COMPANY:",{"$f":"'PDF Information'!F6","v":""},null,null,null,null,null,null,null,null,"END DATE:",null,null,null,"NO",null,"a/v multi",28.01,42.015000000000001,null,null,"yerba buena extra",17.64,{"$f":"X8*1.5","v":26.46},null,77.180000000000007]
[null,null,{"$f":"C10","v":"2013-10-28"},"-","-","-","-","-","-",null,null,null,null,null,null,"NO",null,"head high",{"$f":"S2+2","v":35.64},53.46,{"$f":"S9*2","v":71.28}]
["NAME:","DATE",{"$f":"M7","v":"2013-10-28"},{"$f":"IF(M8>C10,C10+1,\"-\")","v":"-"},{"$f":"IF(M8>D10,D10+1,\"-\")","v":"-"},{"$f":"IF(M8>E10,E10+1,\"-\")","v":"-"},{"$f":"IF(M8>F10,F10+1,\"-\")","v":"-"},{"$f":"IF(M8>G10,G10+1,\"-\")","v":"-"},{"$f":"IF(M8>H10,H10+1,\"-\")","v":"-"},"NO.","RATE","EXTENSION",null,"TOTALS",null,"NO",null,"extra high",{"$f":"S3+2","v":32.14},48.21,{"$f":"S10*2","v":64.28}]
[{"$f":"A6+1","v":1},"REG.",null,null,null,null,null,null,null,{"$f":"SUM(C11:I11)","v":0},{"$f":"IFERROR(VLOOKUP(A11,'Filtered Information'!$A$3:$D$64,2,FALSE),\"0\")","v":"0"},{"$f":"J11*K11","v":0},{"$f":"IF(K11>0,\"SUBTOTAL:\",0)","v":"SUBTOTAL:"},{"$f":"SUM(L11:L15)","v":0},null,{"$f":"IF('Filtered Information'!$B$1>=A11,\"NO\",\"YES\")","v":"YES"}]
[{"$f":"IFERROR(VLOOKUP(A11,'Filtered Information'!$A$3:$E$66,4,FALSE),\"-\")","v":"-"},"O.T.",null,null,null,null,null,null,null,0,{"$f":"IF(J12>0,K11*1.5,)","v":0},0,"VACATION 8%:",{"$f":"N11*0.08","v":0},null,{"$f":"IF('Filtered Information'!$B$1>=A11,\"NO\",\"YES\")","v":"YES"}]
[{"$f":"IFERROR(VLOOKUP(A11,'Filtered Information'!$A$3:$E$66,3,FALSE),\"-\")","v":"-"},"D.T.",null,null,null,null,null,null,null,0,{"$f":"IF(J13>0,K11*2,)","v":0},0,{"$f":"IF(K11>0,\"TOTAL WAGE:\",0)","v":"TOTAL WAGE:"},{"$f":"N11+N12","v":0},{"$f":"N13","v":0},{"$f":"IF('Filtered Information'!$B$1>=A11,\"NO\",\"YES\")","v":"YES"}]
[{"$f":"IFERROR(VLOOKUP(A11,'Filtered Information'!$A$3:$E$64,5,FALSE),\"-\")","v":"-"},"SHOW",null,null,null,null,null,null,null,0,null,0,null,null,null,{"$f":"IF('Filtered Information'!$B$1>=A11,\"NO\",\"YES\")","v":"YES"}]
["LAST 4 SS#","M.P.",null,null,null,null,null,null,null,0,{"$f":"IF(J15>0,K11,)","v":0},0,{"$f":"IF(K11>0,\"UNION 3.5%:\",0)","v":"UNION 3.5%:"},{"$f":"N13*0.035","v":0},null,{"$f":"IF('Filtered Information'!$B$1>=A11,\"NO\",\"YES\")","v":"YES"}]
[{"$f":"A11+1","v":2},"REG.",null,null,null,null,null,null,null,0,{"$f":"IFERROR(VLOOKUP(A16,'Filtered Information'!$A$3:$D$64,2,FALSE),\"0\")","v":"0"},0,{"$f":"IF(K16>0,\"SUBTOTAL:\",0)","v":"SUBTOTAL:"},{"$f":"SUM(L16:L20)","v":0},null,{"$f":"IF('Filtered Information'!$B$1>=A16,\"NO\",\"YES\")","v":"YES"}]
[{"$f":"IFERROR(VLOOKUP(A16,'Filtered Information'!$A$3:$E$66,4,FALSE),\"-\")","v":"-"},"O.T.",null,null,null,null,null,null,null,0,{"$f":"IF(J17>0,K16*1.5,)","v":0},0,"VACATION 8%:",{"$f":"N16*0.08","v":0},null,{"$f":"IF('Filtered Information'!$B$1>=A16,\"NO\",\"YES\")","v":"YES"}]
[{"$f":"IFERROR(VLOOKUP(A16,'Filtered Information'!$A$3:$E$66,3,FALSE),\"-\")","v":"-"},"D.T.",null,null,null,null,null,null,null,0,{"$f":"IF(J18>0,K16*2,)","v":0},0,{"$f":"IF(K16>0,\"TOTAL WAGE:\",0)","v":"TOTAL WAGE:"},{"$f":"N16+N17","v":0},{"$f":"N18","v":0},{"$f":"IF('Filtered Information'!$B$1>=A16,\"NO\",\"YES\")","v":"YES"}]
[{"$f":"IFERROR(VLOOKUP(A16,'Filtered Information'!$A$3:$E$64,5,FALSE),\"-\")","v":"-"},"SHOW",null,null,null,null,null,null,null,0,null,0,null,null,null,{"$f":"IF('Filtered Information'!$B$1>=A16,\"NO\",\"YES\")","v":"YES"}]
[null,"M.P.",null,null,null,null,null,null,null,0,{"$f":"IF(J20>0,K16,)","v":0},0,{"$f":"IF(K16>0,\"UNION 3.5%:\",0)","v":"UNION 3.5%:"},{"$f":"N18*0.035","v":0},null,{"$f":"IF('Filtered Information'!$B$1>=A16,\"NO\",\"YES\")","v":"YES"}]
[{"$f":"A16+1","v":3},"REG.",null,null,null,null,null,null,null,0,{"$f":"IFERROR(VLOOKUP(A21,'Filtered Information'!$A$3:$D$64,2,FALSE),\"0\")","v":"0"},0,{"$f":"IF(K21>0,\"SUBTOTAL:\",0)","v":"SUBTOTAL:"},{"$f":"SUM(L21:L25)","v":0},null,{"$f":"IF('Filtered Information'!$B$1>=A21,\"NO\",\"YES\")","v":"YES"}]
[{"$f":"IFERROR(VLOOKUP(A21,'Filtered Information'!$A$3:$E$66,4,FALSE),\"-\")","v":"-"},"O.T.",null,null,null,null,null,null,null,0,{"$f":"IF(J22>0,K21*1.5,)","v":0},0,"VACATION 8%:",{"$f":"N21*0.08","v":0},null,{"$f":"IF('Filtered Information'!$B$1>=A21,\"NO\",\"YES\")","v":"YES"}]
[{"$f":"IFERROR(VLOOKUP(A21,'Filtered Information'!$A$3:$E$66,3,FALSE),\"-\")","v":"-"},"D.T.",null,null,null,null,null,null,null,0,{"$f":"IF(J23>0,K21*2,)","v":0},0,{"$f":"IF(K21>0,\"TOTAL WAGE:\",0)","v":"TOTAL WAGE:"},{"$f":"N21+N22","v":0},{"$f":"N23","v":0},{"$f":"IF('Filtered Information'!$B$1>=A21,\"NO\",\"YES\")","v":"YES"}]
[{"$f":"IFERROR(VLOOKUP(A21,'Filtered Information'!$A$3:$E$64,5,FALSE),\"-\")","v":"-"},"SHOW",null,null,null,null,null,null,null,0,null,0,null,null,null,{"$f":"IF('Filtered Information'!$B$1>=A21,\"NO\",\"YES\")","v":"YES"}]
[null,"M.P.",null,null,null,null,null,null,null,0,{"$f":"IF(J25>0,K21,)","v":0},0,{"$f":"IF(K21>0,\"UNION 3.5%:\",0)","v":"UNION 3.5%:"},{"$f":"N23*0.035","v":0},null,{"$f":"IF('Filtered Information'!$B$1>=A21,\"NO\",\"YES\")","v":"YES"}]
[{"$f":"A21+1","v":4},"REG.",null,null,null,null,null,null,null,0,{"$f":"IFERROR(VLOOKUP(A26,'Filtered Information'!$A$3:$D$64,2,FALSE),\"0\")","v":"0"},0,{"$f":"IF(K26>0,\"SUBTOTAL:\",0)","v":"SUBTOTAL:"},{"$f":"SUM(L26:L30)","v":0},null,{"$f":"IF('Filtered Information'!$B$1>=A26,\"NO\",\"YES\")","v":"YES"}]
[{"$f":"IFERROR(VLOOKUP(A26,'Filtered Information'!$A$3:$E$66,4,FALSE),\"-\")","v":"-"},"O.T.",null,null,null,null,null,null,null,0,{"$f":"IF(J27>0,K26*1.5,)","v":0},0,"VACATION 8%:",{"$f":"N26*0.08","v":0},null,{"$f":"IF('Filtered Information'!$B$1>=A26,\"NO\",\"YES\")","v":"YES"}]
[{"$f":"IFERROR(VLOOKUP(A26,'Filtered Information'!$A$3:$E$66,3,FALSE),\"-\")","v":"-"},"D.T.",null,null,null,null,null,null,null,0,{"$f":"IF(J28>0,K26*2,)","v":0},0,{"$f":"IF(K26>0,\"TOTAL WAGE:\",0)","v":"TOTAL WAGE:"},{"$f":"N26+N27","v":0},{"$f":"N28","v":0},{"$f":"IF('Filtered Information'!$B$1>=A26,\"NO\",\"YES\")","v":"YES"}]
[{"$f":"IFERROR(VLOOKUP(A26,'Filtered Information'!$A$3:$E$64,5,FALSE),\"-\")","v":"-"},"SHOW",null,null,null,null,null,null,null,0,null,0,null,null,null,{"$f":"IF('Filtered Information'!$B$1>=A26,\"NO\",\"YES\")","v":"YES"}]
[null,"M.P.",null,null,null,null,null,null,null,0,{"$f":"IF(J30>0,K26,)","v":0},0,{"$f":"IF(K26>0,\"UNION 3.5%:\",0)","v":"UNION 3.5%:"},{"$f":"N28*0.035","v":0},null,{"$f":"IF('Filtered Information'!$B$1>=A26,\"NO\",\"YES\")","v":"YES"}]
[{"$f":"A26+1","v":5},"REG.",null,null,null,null,null,null,null,{"$f":"SUM(C31:I31)","v":0},{"$f":"IFERROR(VLOOKUP(A31,'Filtered Information'!$A$3:$D$64,2,FALSE),\"0\")","v":"0"},{"$f":"J31*K31","v":0},{"$f":"IF(K31>0,\"SUBTOTAL:\",0)","v":"SUBTOTAL:"},{"$f":"SUM(L31:L35)","v":0},null,{"$f":"IF('Filtered Information'!$B$1>=A31,\"NO\",\"YES\")","v":"YES"}]
[{"$f":"IFERROR(VLOOKUP(A31,'Filtered Information'!$A$3:$E$66,4,FALSE),\"-\")","v":"-"},"O.T.",null,null,null,null,null,null,null,0,{"$f":"IF(J32>0,K31*1.5,)","v":0},0,"VACATION 8%:",{"$f":"N31*0.08","v":0},null,{"$f":"IF('Filtered Information'!$B$1>=A31,\"NO\",\"YES\")","v":"YES"}]
[{"$f":"IFERROR(VLOOKUP(A31,'Filtered Information'!$A$3:$E$66,3,FALSE),\"-\")","v":"-"},"D.T.",null,null,null,null,null,null,null,0,{"$f":"IF(J33>0,K31*2,)","v":0},0,{"$f":"IF(K31>0,\"TOTAL WAGE:\",0)","v":"TOTAL WAGE:"},{"$f":"N31+N32","v":0},{"$f":"N33","v":0},{"$f":"IF('Filtered Information'!$B$1>=A31,\"NO\",\"YES\")","v":"YES"}]
[{"$f":"IFERROR(VLOOKUP(A31,'Filtered Information'!$A$3:$E$64,5,FALSE),\"-\")","v":"-"},"SHOW",null,null,null,null,null,null,null,0,null,0,null,null,null,{"$f":"IF('Filtered Information'!$B$1>=A31,\"NO\",\"YES\")","v":"YES"}]
[null,"M.P.",null,null,null,null,null,null,null,0,{"$f":"IF(J35>0,K31,)","v":0},0,{"$f":"IF(K31>0,\"UNION 3.5%:\",0)","v":"UNION 3.5%:"},{"$f":"N33*0.035","v":0},null,{"$f":"IF('Filtered Information'!$B$1>=A31,\"NO\",\"YES\")","v":"YES"}]
[{"$f":"A31+1","v":6},"REG.",null,null,null,null,null,null,null,0,{"$f":"IFERROR(VLOOKUP(A36,'Filtered Information'!$A$3:$D$64,2,FALSE),\"0\")","v":"0"},0,{"$f":"IF(K36>0,\"SUBTOTAL:\",0)","v":"SUBTOTAL:"},{"$f":"SUM(L36:L40)","v":0},null,{"$f":"IF('Filtered Information'!$B$1>=A36,\"NO\",\"YES\")","v":"YES"}]
[{"$f":"IFERROR(VLOOKUP(A36,'Filtered Information'!$A$3:$E$66,4,FALSE),\"-\")","v":"-"},"O.T.",null,null,null,null,null,null,null,0,{"$f":"IF(J37>0,K36*1.5,)","v":0},0,"VACATION 8%:",{"$f":"N36*0.08","v":0},null,{"$f":"IF('Filtered Information'!$B$1>=A36,\"NO\",\"YES\")","v":"YES"}]
[{"$f":"IFERROR(VLOOKUP(A36,'Filtered Information'!$A$3:$E$66,3,FALSE),\"-\")","v":"-"},"D.T.",null,null,null,null,null,null,null,0,{"$f":"IF(J38>0,K36*2,)","v":0},0,{"$f":"IF(K36>0,\"TOTAL WAGE:\",0)","v":"TOTAL WAGE:"},{"$f":"N36+N37","v":0},{"$f":"N38","v":0},{"$f":"IF('Filtered Information'!$B$1>=A36,\"NO\",\"YES\")","v":"YES"}]
[{"$f":"IFERROR(VLOOKUP(A36,'Filtered Information'!$A$3:$E$64,5,FALSE),\"-\")","v":"-"},"SHOW",null,null,null,null,null,null,null,0,null,0,null,null,null,{"$f":"IF('Filtered Information'!$B$1>=A36,\"NO\",\"YES\")","v":"YES"}]
[null,"M.P.",null,null,null,null,null,null,null,0,{"$f":"IF(J40>0,K36,)","v":0},0,{"$f":"IF(K36>0,\"UNION 3.5%:\",0)","v":"UNION 3.5%:"},{"$f":"N38*0.035","v":0},null,{"$f":"IF('Filtered Information'!$B$1>=A36,\"NO\",\"YES\")","v":"YES"}]
[{"$f":"A36+1","v":7},"REG.",null,null,null,null,null,null,null,0,{"$f":"IFERROR(VLOOKUP(A41,'Filtered Information'!$A$3:$D$64,2,FALSE),\"0\")","v":"0"},0,{"$f":"IF(K41>0,\"SUBTOTAL:\",0)","v":"SUBTOTAL:"},{"$f":"SUM(L41:L45)","v":0},null,{"$f":"IF('Filtered Information'!$B$1>=A41,\"NO\",\"YES\")","v":"YES"}]
[{"$f":"IFERROR(VLOOKUP(A41,'Filtered Information'!$A$3:$E$66,4,FALSE),\"-\")","v":"-"},"O.T.",null,null,null,null,null,null,null,0,{"$f":"IF(J42>0,K41*1.5,)","v":0},0,"VACATION 8%:",{"$f":"N41*0.08","v":0},null,{"$f":"IF('Filtered Information'!$B$1>=A41,\"NO\",\"YES\")","v":"YES"}]
[{"$f":"IFERROR(VLOOKUP(A41,'Filtered Information'!$A$3:$E$66,3,FALSE),\"-\")","v":"-"},"D.T.",null,null,null,null,null,null,null,0,{"$f":"IF(J43>0,K41*2,)","v":0},0,{"$f":"IF(K41>0,\"TOTAL WAGE:\",0)","v":"TOTAL WAGE:"},{"$f":"N41+N42","v":0},{"$f":"N43","v":0},{"$f":"IF('Filtered Information'!$B$1>=A41,\"NO\",\"YES\")","v":"YES"}]
[{"$f":"IFERROR(VLOOKUP(A41,'Filtered Information'!$A$3:$E$64,5,FALSE),\"-\")","v":"-"},"SHOW",null,null,null,null,null,null,null,0,null,0,null,null,null,{"$f":"IF('Filtered Information'!$B$1>=A41,\"NO\",\"YES\")","v":"YES"}]
[null,"M.P.",null,null,null,null,null,null,null,0,{"$f":"IF(J45>0,K41,)","v":0},0,{"$f":"IF(K41>0,\"UNION 3.5%:\",0)","v":"UNION 3.5%:"},{"$f":"N43*0.035","v":0},null,{"$f":"IF('Filtered Information'!$B$1>=A41,\"NO\",\"YES\")","v":"YES"}]
[{"$f":"A41+1","v":8},"REG.",null,null,null,null,null,null,null,0,{"$f":"IFERROR(VLOOKUP(A46,'Filtered Information'!$A$3:$D$64,2,FALSE),\"0\")","v":"0"},0,{"$f":"IF(K46>0,\"SUBTOTAL:\",0)","v":"SUBTOTAL:"},{"$f":"SUM(L46:L50)","v":0},null,{"$f":"IF('Filtered Information'!$B$1>=A46,\"NO\",\"YES\")","v":"YES"}]
[{"$f":"IFERROR(VLOOKUP(A46,'Filtered Information'!$A$3:$E$66,4,FALSE),\"-\")","v":"-"},"O.T.",null,null,null,null,null,null,null,0,{"$f":"IF(J47>0,K46*1.5,)","v":0},0,"VACATION 8%:",{"$f":"N46*0.08","v":0},null,{"$f":"IF('Filtered Information'!$B$1>=A46,\"NO\",\"YES\")","v":"YES"}]
[{"$f":"IFERROR(VLOOKUP(A46,'Filtered Information'!$A$3:$E$66,3,FALSE),\"-\")","v":"-"},"D.T.",null,null,null,null,null,null,null,0,{"$f":"IF(J48>0,K46*2,)","v":0},0,{"$f":"IF(K46>0,\"TOTAL WAGE:\",0)","v":"TOTAL WAGE:"},{"$f":"N46+N47","v":0},{"$f":"N48","v":0},{"$f":"IF('Filtered Information'!$B$1>=A46,\"NO\",\"YES\")","v":"YES"}]
[{"$f":"IFERROR(VLOOKUP(A46,'Filtered Information'!$A$3:$E$64,5,FALSE),\"-\")","v":"-"},"SHOW",null,null,null,null,null,null,null,0,null,0,null,null,null,{"$f":"IF('Filtered Information'!$B$1>=A46,\"NO\",\"YES\")","v":"YES"}]
[null,"M.P.",null,null,null,null,null,null,null,0,{"$f":"IF(J50>0,K46,)","v":0},0,{"$f":"IF(K46>0,\"UNION 3.5%:\",0)","v":"UNION 3.5%:"},{"$f":"N48*0.035","v":0},null,{"$f":"IF('Filtered Information'!$B$1>=A46,\"NO\",\"YES\")","v":"YES"}]
[{"$f":"A46+1","v":9},"REG.",null,null,null,null,null,null,null,0,{"$f":"IFERROR(VLOOKUP(A51,'Filtered Information'!$A$3:$D$64,2,FALSE),\"0\")","v":"0"},0,{"$f":"IF(K51>0,\"SUBTOTAL:\",0)","v":"SUBTOTAL:"},{"$f":"SUM(L51:L55)","v":0},null,{"$f":"IF('Filtered Information'!$B$1>=A51,\"NO\",\"YES\")","v":"YES"}]
[{"$f":"IFERROR(VLOOKUP(A51,'Filtered Information'!$A$3:$E$66,4,FALSE),\"-\")","v":"-"},"O.T.",null,null,null,null,null,null,null,0,{"$f":"IF(J52>0,K51*1.5,)","v":0},0,"VACATION 8%:",{"$f":"N51*0.08","v":0},null,{"$f":"IF('Filtered Information'!$B$1>=A51,\"NO\",\"YES\")","v":"YES"}]
[{"$f":"IFERROR(VLOOKUP(A51,'Filtered Information'!$A$3:$E$66,3,FALSE),\"-\")","v":"-"},"D.T.",null,null,null,null,null,null,null,0,{"$f":"IF(J53>0,K51*2,)","v":0},0,{"$f":"IF(K51>0,\"TOTAL WAGE:\",0)","v":"TOTAL WAGE:"},{"$f":"N51+N52","v":0},{"$f":"N53","v":0},{"$f":"IF('Filtered Information'!$B$1>=A51,\"NO\",\"YES\")","v":"YES"}]
[{"$f":"IFERROR(VLOOKUP(A51,'Filtered Information'!$A$3:$E$64,5,FALSE),\"-\")","v":"-"},"SHOW",null,null,null,null,null,null,null,0,null,0,null,null,null,{"$f":"IF('Filtered Information'!$B$1>=A51,\"NO\",\"YES\")","v":"YES"}]
[null,"M.P.",null,null,null,null,null,null,null,0,{"$f":"IF(J55>0,K51,)","v":0},0,{"$f":"IF(K51>0,\"UNION 3.5%:\",0)","v":"UNION 3.5%:"},{"$f":"N53*0.035","v":0},null,{"$f":"IF('Filtered Information'!$B$1>=A51,\"NO\",\"YES\")","v":"YES"}]
[{"$f":"A51+1","v":10},"REG.",null,null,null,null,null,null,null,0,{"$f":"IFERROR(VLOOKUP(A56,'Filtered Information'!$A$3:$D$64,2,FALSE),\"0\")","v":"0"},0,{"$f":"IF(K56>0,\"SUBTOTAL:\",0)","v":"SUBTOTAL:"},{"$f":"SUM(L56:L60)","v":0},null,{"$f":"IF('Filtered Information'!$B$1>=A56,\"NO\",\"YES\")","v":"YES"}]
[{"$f":"IFERROR(VLOOKUP(A56,'Filtered Information'!$A$3:$E$66,4,FALSE),\"-\")","v":"-"},"O.T.",null,null,null,null,null,null,null,0,{"$f":"IF(J57>0,K56*1.5,)","v":0},0,"VACATION 8%:",{"$f":"N56*0.08","v":0},null,{"$f":"IF('Filtered Information'!$B$1>=A56,\"NO\",\"YES\")","v":"YES"}]
[{"$f":"IFERROR(VLOOKUP(A56,'Filtered Information'!$A$3:$E$66,3,FALSE),\"-\")","v":"-"},"D.T.",null,null,null,null,null,null,null,0,{"$f":"IF(J58>0,K56*2,)","v":0},0,{"$f":"IF(K56>0,\"TOTAL WAGE:\",0)","v":"TOTAL WAGE:"},{"$f":"N56+N57","v":0},{"$f":"N58","v":0},{"$f":"IF('Filtered Information'!$B$1>=A56,\"NO\",\"YES\")","v":"YES"}]
[{"$f":"IFERROR(VLOOKUP(A56,'Filtered Information'!$A$3:$E$64,5,FALSE),\"-\")","v":"-"},"SHOW",null,null,null,null,null,null,null,0,null,0,null,null,null,{"$f":"IF('Filtered Information'!$B$1>=A56,\"NO\",\"YES\")","v":"YES"}]
[null,"M.P.",null,null,null,null,null,null,null,0,{"$f":"IF(J60>0,K56,)","v":0},0,{"$f":"IF(K56>0,\"UNION 3.5%:\",0)","v":"UNION 3.5%:"},{"$f":"N58*0.035","v":0},null,{"$f":"IF('Filtered Information'!$B$1>=A56,\"NO\",\"YES\")","v":"YES"}]
[{"$f":"A56+1","v":11},"REG.",null,null,null,null,null,null,null,0,{"$f":"IFERROR(VLOOKUP(A61,'Filtered Information'!$A$3:$D$64,2,FALSE),\"0\")","v":"0"},0,{"$f":"IF(K61>0,\"SUBTOTAL:\",0)","v":"SUBTOTAL:"},{"$f":"SUM(L61:L65)","v":0},null,{"$f":"IF('Filtered Information'!$B$1>=A61,\"NO\",\"YES\")","v":"YES"}]
[{"$f":"IFERROR(VLOOKUP(A61,'Filtered Information'!$A$3:$E$66,4,FALSE),\"-\")","v":"-"},"O.T.",null,null,null,null,null,null,null,0,{"$f":"IF(J62>0,K61*1.5,)","v":0},0,"VACATION 8%:",{"$f":"N61*0.08","v":0},null,{"$f":"IF('Filtered Information'!$B$1>=A61,\"NO\",\"YES\")","v":"YES"}]
[{"$f":"IFERROR(VLOOKUP(A61,'Filtered Information'!$A$3:$E$66,3,FALSE),\"-\")","v":"-"},"D.T.",null,null,null,null,null,null,null,{"$f":"SUM(C63:I63)","v":0},{"$f":"IF(J63>0,K61*2,)","v":0},{"$f":"J63*K63","v":0},{"$f":"IF(K61>0,\"TOTAL WAGE:\",0)","v":"TOTAL WAGE:"},{"$f":"N61+N62","v":0},{"$f":"N63","v":0},{"$f":"IF('Filtered Information'!$B$1>=A61,\"NO\",\"YES\")","v":"YES"}]
[{"$f":"IFERROR(VLOOKUP(A61,'Filtered Information'!$A$3:$E$64,5,FALSE),\"-\")","v":"-"},"SHOW",null,null,null,null,null,null,null,0,null,0,null,null,null,{"$f":"IF('Filtered Information'!$B$1>=A61,\"NO\",\"YES\")","v":"YES"}]
[null,"M.P.",null,null,null,null,null,null,null,0,{"$f":"IF(J65>0,K61,)","v":0},0,{"$f":"IF(K61>0,\"UNION 3.5%:\",0)","v":"UNION 3.5%:"},{"$f":"N63*0.035","v":0},null,{"$f":"IF('Filtered Information'!$B$1>=A61,\"NO\",\"YES\")","v":"YES"}]
[{"$f":"A61+1","v":12},"REG.",null,null,null,null,null,null,null,0,{"$f":"IFERROR(VLOOKUP(A66,'Filtered Information'!$A$3:$D$64,2,FALSE),\"0\")","v":"0"},0,{"$f":"IF(K66>0,\"SUBTOTAL:\",0)","v":"SUBTOTAL:"},{"$f":"SUM(L66:L70)","v":0},null,{"$f":"IF('Filtered Information'!$B$1>=A66,\"NO\",\"YES\")","v":"YES"}]
[{"$f":"IFERROR(VLOOKUP(A66,'Filtered Information'!$A$3:$E$66,4,FALSE),\"-\")","v":"-"},"O.T.",null,null,null,null,null,null,null,0,{"$f":"IF(J67>0,K66*1.5,)","v":0},0,"VACATION 8%:",{"$f":"N66*0.08","v":0},null,{"$f":"IF('Filtered Information'!$B$1>=A66,\"NO\",\"YES\")","v":"YES"}]
[{"$f":"IFERROR(VLOOKUP(A66,'Filtered Information'!$A$3:$E$66,3,FALSE),\"-\")","v":"-"},"D.T.",null,null,null,null,null,null,null,0,{"$f":"IF(J68>0,K66*2,)","v":0},0,{"$f":"IF(K66>0,\"TOTAL WAGE:\",0)","v":"TOTAL WAGE:"},{"$f":"N66+N67","v":0},{"$f":"N68","v":0},{"$f":"IF('Filtered Information'!$B$1>=A66,\"NO\",\"YES\")","v":"YES"}]
[{"$f":"IFERROR(VLOOKUP(A66,'Filtered Information'!$A$3:$E$64,5,FALSE),\"-\")","v":"-"},"SHOW",null,null,null,null,null,null,null,0,null,0,null,null,null,{"$f":"IF('Filtered Information'!$B$1>=A66,\"NO\",\"YES\")","v":"YES"}]
[null,"M.P.",null,null,null,null,null,null,null,0,{"$f":"IF(J70>0,K66,)","v":0},0,{"$f":"IF(K66>0,\"UNION 3.5%:\",0)","v":"UNION 3.5%:"},{"$f":"N68*0.035","v":0},null,{"$f":"IF('Filtered Information'!$B$1>=A66,\"NO\",\"YES\")","v":"YES"}]
[{"$f":"A66+1","v":13},"REG.",null,null,null,null,null,null,null,0,{"$f":"IFERROR(VLOOKUP(A71,'Filtered Information'!$A$3:$D$64,2,FALSE),\"0\")","v":"0"},0,{"$f":"IF(K71>0,\"SUBTOTAL:\",0)","v":"SUBTOTAL:"},{"$f":"SUM(L71:L75)","v":0},null,{"$f":"IF('Filtered Information'!$B$1>=A71,\"NO\",\"YES\")","v":"YES"}]
[{"$f":"IFERROR(VLOOKUP(A71,'Filtered Information'!$A$3:$E$66,4,FALSE),\"-\")","v":"-"},"O.T.",null,null,null,null,null,null,null,0,{"$f":"IF(J72>0,K71*1.5,)","v":0},0,"VACATION 8%:",{"$f":"N71*0.08","v":0},null,{"$f":"IF('Filtered Information'!$B$1>=A71,\"NO\",\"YES\")","v":"YES"}]
[{"$f":"IFERROR(VLOOKUP(A71,'Filtered Information'!$A$3:$E$66,3,FALSE),\"-\")","v":"-"},"D.T.",null,null,null,null,null,null,null,0,{"$f":"IF(J73>0,K71*2,)","v":0},0,{"$f":"IF(K71>0,\"TOTAL WAGE:\",0)","v":"TOTAL WAGE:"},{"$f":"N71+N72","v":0},{"$f":"N73","v":0},{"$f":"IF('Filtered Information'!$B$1>=A71,\"NO\",\"YES\")","v":"YES"}]
[{"$f":"IFERROR(VLOOKUP(A71,'Filtered Information'!$A$3:$E$64,5,FALSE),\"-\")","v":"-"},"SHOW",null,null,null,null,null,null,null,0,null,0,null,null,null,{"$f":"IF('Filtered Information'!$B$1>=A71,\"NO\",\"YES\")","v":"YES"}]
[null,"M.P.",null,null,null,null,null,null,null,0,{"$f":"IF(J75>0,K71,)","v":0},0,{"$f":"IF(K71>0,\"UNION 3.5%:\",0)","v":"UNION 3.5%:"},{"$f":"N73*0.035","v":0},null,{"$f":"IF('Filtered Information'!$B$1>=A71,\"NO\",\"YES\")","v":"YES"}]
[{"$f":"A71+1","v":14},"REG.",null,null,null,null,null,null,null,0,{"$f":"IFERROR(VLOOKUP(A76,'Filtered Information'!$A$3:$D$64,2,FALSE),\"0\")","v":"0"},0,{"$f":"IF(K76>0,\"SUBTOTAL:\",0)","v":"SUBTOTAL:"},{"$f":"SUM(L76:L80)","v":0},null,{"$f":"IF('Filtered Information'!$B$1>=A76,\"NO\",\"YES\")","v":"YES"}]
[{"$f":"IFERROR(VLOOKUP(A76,'Filtered Information'!$A$3:$E$66,4,FALSE),\"-\")","v":"-"},"O.T.",null,null,null,null,null,null,null,0,{"$f":"IF(J77>0,K76*1.5,)","v":0},0,"VACATION 8%:",{"$f":"N76*0.08","v":0},null,{"$f":"IF('Filtered Information'!$B$1>=A76,\"NO\",\"YES\")","v":"YES"}]
[{"$f":"IFERROR(VLOOKUP(A76,'Filtered Information'!$A$3:$E$66,3,FALSE),\"-\")","v":"-"},"D.T.",null,null,null,null,null,null,null,0,{"$f":"IF(J78>0,K76*2,)","v":0},0,{"$f":"IF(K76>0,\"TOTAL WAGE:\",0)","v":"TOTAL WAGE:"},{"$f":"N76+N77","v":0},{"$f":"N78","v":0},{"$f":"IF('Filtered Information'!$B$1>=A76,\"NO\",\"YES\")","v":"YES"}]
[{"$f":"IFERROR(VLOOKUP(A76,'Filtered Information'!$A$3:$E$64,5,FALSE),\"-\")","v":"-"},"SHOW",null,null,null,null,null,null,null,0,null,0,null,null,null,{"$f":"IF('Filtered Information'!$B$1>=A76,\"NO\",\"YES\")","v":"YES"}]
[null,"M.P.",null,null,null,null,null,null,null,0,{"$f":"IF(J80>0,K76,)","v":0},0,{"$f":"IF(K76>0,\"UNION 3.5%:\",0)","v":"UNION 3.5%:"},{"$f":"N78*0.035","v":0},null,{"$f":"IF('Filtered Information'!$B$1>=A76,\"NO\",\"YES\")","v":"YES"}]
[{"$f":"A76+1","v":15},"REG.",null,null,null,null,null,null,null,0,{"$f":"IFERROR(VLOOKUP(A81,'Filtered Information'!$A$3:$D$64,2,FALSE),\"0\")","v":"0"},0,{"$f":"IF(K81>0,\"SUBTOTAL:\",0)","v":"SUBTOTAL:"},{"$f":"SUM(L81:L85)","v":0},null,{"$f":"IF('Filtered Information'!$B$1>=A81,\"NO\",\"YES\")","v":"YES"}]
[{"$f":"IFERROR(VLOOKUP(A81,'Filtered Information'!$A$3:$E$66,4,FALSE),\"-\")","v":"-"},"O.T.",null,null,null,null,null,null,null,0,{"$f":"IF(J82>0,K81*1.5,)","v":0},0,"VACATION 8%:",{"$f":"N81*0.08","v":0},null,{"$f":"IF('Filtered Information'!$B$1>=A81,\"NO\",\"YES\")","v":"YES"}]
[{"$f":"IFERROR(VLOOKUP(A81,'Filtered Information'!$A$3:$E$66,3,FALSE),\"-\")","v":"-"},"D.T.",null,null,null,null,null,null,null,0,{"$f":"IF(J83>0,K81*2,)","v":0},0,{"$f":"IF(K81>0,\"TOTAL WAGE:\",0)","v":"TOTAL WAGE:"},{"$f":"N81+N82","v":0},{"$f":"N83","v":0},{"$f":"IF('Filtered Information'!$B$1>=A81,\"NO\",\"YES\")","v":"YES"}]
[{"$f":"IFERROR(VLOOKUP(A81,'Filtered Information'!$A$3:$E$64,5,FALSE),\"-\")","v":"-"},"SHOW",null,null,null,null,null,null,null,0,null,0,null,null,null,{"$f":"IF('Filtered Information'!$B$1>=A81,\"NO\",\"YES\")","v":"YES"}]
[null,"M.P.",null,null,null,null,null,null,null,0,{"$f":"IF(J85>0,K81,)","v":0},0,{"$f":"IF(K81>0,\"UNION 3.5%:\",0)","v":"UNION 3.5%:"},{"$f":"N83*0.035","v":0},null,{"$f":"IF('Filtered Information'!$B$1>=A81,\"NO\",\"YES\")","v":"YES"}]
[{"$f":"A81+1","v":16},"REG.",null,null,null,null,null,null,null,0,{"$f":"IFERROR(VLOOKUP(A86,'Filtered Information'!$A$3:$D$64,2,FALSE),\"0\")","v":"0"},0,{"$f":"IF(K86>0,\"SUBTOTAL:\",0)","v":"SUBTOTAL:"},{"$f":"SUM(L86:L90)","v":0},null,{"$f":"IF('Filtered Information'!$B$1>=A86,\"NO\",\"YES\")","v":"YES"}]
[{"$f":"IFERROR(VLOOKUP(A86,'Filtered Information'!$A$3:$E$66,4,FALSE),\"-\")","v":"-"},"O.T.",null,null,null,null,null,null,null,0,{"$f":"IF(J87>0,K86*1.5,)","v":0},0,"VACATION 8%:",{"$f":"N86*0.08","v":0},null,{"$f":"IF('Filtered Information'!$B$1>=A86,\"NO\",\"YES\")","v":"YES"}]
[{"$f":"IFERROR(VLOOKUP(A86,'Filtered Information'!$A$3:$E$66,3,FALSE),\"-\")","v":"-"},"D.T.",null,null,null,null,null,null,null,0,{"$f":"IF(J88>0,K86*2,)","v":0},0,{"$f":"IF(K86>0,\"TOTAL WAGE:\",0)","v":"TOTAL WAGE:"},{"$f":"N86+N87","v":0},{"$f":"N88","v":0},{"$f":"IF('Filtered Information'!$B$1>=A86,\"NO\",\"YES\")","v":"YES"}]
[{"$f":"IFERROR(VLOOKUP(A86,'Filtered Information'!$A$3:$E$64,5,FALSE),\"-\")","v":"-"},"SHOW",null,null,null,null,null,null,null,0,null,0,null,null,null,{"$f":"IF('Filtered Information'!$B$1>=A86,\"NO\",\"YES\")","v":"YES"}]
[null,"M.P.",null,null,null,null,null,null,null,0,{"$f":"IF(J90>0,K86,)","v":0},0,{"$f":"IF(K86>0,\"UNION 3.5%:\",0)","v":"UNION 3.5%:"},{"$f":"N88*0.035","v":0},null,{"$f":"IF('Filtered Information'!$B$1>=A86,\"NO\",\"YES\")","v":"YES"}]
[{"$f":"A86+1","v":17},"REG.",null,null,null,null,null,null,null,0,{"$f":"IFERROR(VLOOKUP(A91,'Filtered Information'!$A$3:$D$64,2,FALSE),\"0\")","v":"0"},0,{"$f":"IF(K91>0,\"SUBTOTAL:\",0)","v":"SUBTOTAL:"},{"$f":"SUM(L91:L95)","v":0},null,{"$f":"IF('Filtered Information'!$B$1>=A91,\"NO\",\"YES\")","v":"YES"}]
[{"$f":"IFERROR(VLOOKUP(A91,'Filtered Information'!$A$3:$E$66,4,FALSE),\"-\")","v":"-"},"O.T.",null,null,null,null,null,null,null,0,{"$f":"IF(J92>0,K91*1.5,)","v":0},0,"VACATION 8%:",{"$f":"N91*0.08","v":0},null,{"$f":"IF('Filtered Information'!$B$1>=A91,\"NO\",\"YES\")","v":"YES"}]
[{"$f":"IFERROR(VLOOKUP(A91,'Filtered Information'!$A$3:$E$66,3,FALSE),\"-\")","v":"-"},"D.T.",null,null,null,null,null,null,null,0,{"$f":"IF(J93>0,K91*2,)","v":0},0,{"$f":"IF(K91>0,\"TOTAL WAGE:\",0)","v":"TOTAL WAGE:"},{"$f":"N91+N92","v":0},{"$f":"N93","v":0},{"$f":"IF('Filtered Information'!$B$1>=A91,\"NO\",\"YES\")","v":"YES"}]
[{"$f":"IFERROR(VLOOKUP(A91,'Filtered Information'!$A$3:$E$64,5,FALSE),\"-\")","v":"-"},"SHOW",null,null,null,null,null,null,null,0,null,0,null,null,null,{"$f":"IF('Filtered Information'!$B$1>=A91,\"NO\",\"YES\")","v":"YES"}]
[null,"M.P.",null,null,null,null,null,null,null,{"$f":"SUM(C95:I95)","v":0},{"$f":"IF(J95>0,K91,)","v":0},{"$f":"J95*K95","v":0},{"$f":"IF(K91>0,\"UNION 3.5%:\",0)","v":"UNION 3.5%:"},{"$f":"N93*0.035","v":0},null,{"$f":"IF('Filtered Information'!$B$1>=A91,\"NO\",\"YES\")","v":"YES"}]
[{"$f":"A91+1","v":18},"REG.",null,null,null,null,null,null,null,0,{"$f":"IFERROR(VLOOKUP(A96,'Filtered Information'!$A$3:$D$64,2,FALSE),\"0\")","v":"0"},0,{"$f":"IF(K96>0,\"SUBTOTAL:\",0)","v":"SUBTOTAL:"},{"$f":"SUM(L96:L100)","v":0},null,{"$f":"IF('Filtered Information'!$B$1>=A96,\"NO\",\"YES\")","v":"YES"}]
[{"$f":"IFERROR(VLOOKUP(A96,'Filtered Information'!$A$3:$E$66,4,FALSE),\"-\")","v":"-"},"O.T.",null,null,null,null,null,null,null,0,{"$f":"IF(J97>0,K96*1.5,)","v":0},0,"VACATION 8%:",{"$f":"N96*0.08","v":0},null,{"$f":"IF('Filtered Information'!$B$1>=A96,\"NO\",\"YES\")","v":"YES"}]
[{"$f":"IFERROR(VLOOKUP(A96,'Filtered Information'!$A$3:$E$66,3,FALSE),\"-\")","v":"-"},"D.T.",null,null,null,null,null,null,null,0,{"$f":"IF(J98>0,K96*2,)","v":0},0,{"$f":"IF(K96>0,\"TOTAL WAGE:\",0)","v":"TOTAL WAGE:"},{"$f":"N96+N97","v":0},{"$f":"N98","v":0},{"$f":"IF('Filtered Information'!$B$1>=A96,\"NO\",\"YES\")","v":"YES"}]
[{"$f":"IFERROR(VLOOKUP(A96,'Filtered Information'!$A$3:$E$64,5,FALSE),\"-\")","v":"-"},"SHOW",null,null,null,null,null,null,null,0,null,0,null,null,null,{"$f":"IF('Filtered Information'!$B$1>=A96,\"NO\",\"YES\")","v":"YES"}]
[null,"M.P.",null,null,null,null,null,null,null,0,{"$f":"IF(J100>0,K96,)","v":0},0,{"$f":"IF(K96>0,\"UNION 3.5%:\",0)","v":"UNION 3.5%:"},{"$f":"N98*0.035","v":0},null,{"$f":"IF('Filtered Information'!$B$1>=A96,\"NO\",\"YES\")","v":"YES"}]
[{"$f":"A96+1","v":19},"REG.",null,null,null,null,null,null,null,{"$f":"SUM(C101:I101)","v":0},{"$f":"IFERROR(VLOOKUP(A101,'Filtered Information'!$A$3:$D$64,2,FALSE),\"0\")","v":"0"},{"$f":"J101*K101","v":0},{"$f":"IF(K101>0,\"SUBTOTAL:\",0)","v":"SUBTOTAL:"},{"$f":"SUM(L101:L105)","v":0},null,{"$f":"IF('Filtered Information'!$B$1>=A101,\"NO\",\"YES\")","v":"YES"}]
[{"$f":"IFERROR(VLOOKUP(A101,'Filtered Information'!$A$3:$E$66,4,FALSE),\"-\")","v":"-"},"O.T.",null,null,null,null,null,null,null,0,{"$f":"IF(J102>0,K101*1.5,)","v":0},0,"VACATION 8%:",{"$f":"N101*0.08","v":0},null,{"$f":"IF('Filtered Information'!$B$1>=A101,\"NO\",\"YES\")","v":"YES"}]
[{"$f":"IFERROR(VLOOKUP(A101,'Filtered Information'!$A$3:$E$66,3,FALSE),\"-\")","v":"-"},"D.T.",null,null,null,null,null,null,null,0,{"$f":"IF(J103>0,K101*2,)","v":0},0,{"$f":"IF(K101>0,\"TOTAL WAGE:\",0)","v":"TOTAL WAGE:"},{"$f":"N101+N102","v":0},{"$f":"N103","v":0},{"$f":"IF('Filtered Information'!$B$1>=A101,\"NO\",\"YES\")","v":"YES"}]
[{"$f":"IFERROR(VLOOKUP(A101,'Filtered Information'!$A$3:$E$64,5,FALSE),\"-\")","v":"-"},"SHOW",null,null,null,null,null,null,null,0,null,0,null,null,null,{"$f":"IF('Filtered Information'!$B$1>=A101,\"NO\",\"YES\")","v":"YES"}]
[null,"M.P.",null,null,null,null,null,null,null,0,{"$f":"IF(J105>0,K101,)","v":0},0,{"$f":"IF(K101>0,\"UNION 3.5%:\",0)","v":"UNION 3.5%:"},{"$f":"N103*0.035","v":0},null,{"$f":"IF('Filtered Information'!$B$1>=A101,\"NO\",\"YES\")","v":"YES"}]
[{"$f":"A101+1","v":20},"REG.",null,null,null,null,null,null,null,0,{"$f":"IFERROR(VLOOKUP(A106,'Filtered Information'!$A$3:$D$64,2,FALSE),\"0\")","v":"0"},0,{"$f":"IF(K106>0,\"SUBTOTAL:\",0)","v":"SUBTOTAL:"},{"$f":"SUM(L106:L110)","v":0},null,{"$f":"IF('Filtered Information'!$B$1>=A106,\"NO\",\"YES\")","v":"YES"}]
[{"$f":"IFERROR(VLOOKUP(A106,'Filtered Information'!$A$3:$E$66,4,FALSE),\"-\")","v":"-"},"O.T.",null,null,null,null,null,null,null,0,{"$f":"IF(J107>0,K106*1.5,)","v":0},0,"VACATION 8%:",{"$f":"N106*0.08","v":0},null,{"$f":"IF('Filtered Information'!$B$1>=A106,\"NO\",\"YES\")","v":"YES"}]
[{"$f":"IFERROR(VLOOKUP(A106,'Filtered Information'!$A$3:$E$66,3,FALSE),\"-\")","v":"-"},"D.T.",null,null,null,null,null,null,null,0,{"$f":"IF(J108>0,K106*2,)","v":0},0,{"$f":"IF(K106>0,\"TOTAL WAGE:\",0)","v":"TOTAL WAGE:"},{"$f":"N106+N107","v":0},{"$f":"N108","v":0},{"$f":"IF('Filtered Information'!$B$1>=A106,\"NO\",\"YES\")","v":"YES"}]
[{"$f":"IFERROR(VLOOKUP(A106,'Filtered Information'!$A$3:$E$64,5,FALSE),\"-\")","v":"-"},"SHOW",null,null,null,null,null,null,null,0,null,0,null,null,null,{"$f":"IF('Filtered Information'!$B$1>=A106,\"NO\",\"YES\")","v":"YES"}]
[null,"M.P.",null,null,null,null,null,null,null,0,{"$f":"IF(J110>0,K106,)","v":0},0,{"$f":"IF(K106>0,\"UNION 3.5%:\",0)","v":"UNION 3.5%:"},{"$f":"N108*0.035","v":0},null,{"$f":"IF('Filtered Information'!$B$1>=A106,\"NO\",\"YES\")","v":"YES"}]
[{"$f":"A106+1","v":21},"REG.",null,null,null,null,null,null,null,0,{"$f":"IFERROR(VLOOKUP(A111,'Filtered Information'!$A$3:$D$64,2,FALSE),\"0\")","v":"0"},0,{"$f":"IF(K111>0,\"SUBTOTAL:\",0)","v":"SUBTOTAL:"},{"$f":"SUM(L111:L115)","v":0},null,{"$f":"IF('Filtered Information'!$B$1>=A111,\"NO\",\"YES\")","v":"YES"}]
[{"$f":"IFERROR(VLOOKUP(A111,'Filtered Information'!$A$3:$E$66,4,FALSE),\"-\")","v":"-"},"O.T.",null,null,null,null,null,null,null,0,{"$f":"IF(J112>0,K111*1.5,)","v":0},0,"VACATION 8%:",{"$f":"N111*0.08","v":0},null,{"$f":"IF('Filtered Information'!$B$1>=A111,\"NO\",\"YES\")","v":"YES"}]
[{"$f":"IFERROR(VLOOKUP(A111,'Filtered Information'!$A$3:$E$66,3,FALSE),\"-\")","v":"-"},"D.T.",null,null,null,null,null,null,null,0,{"$f":"IF(J113>0,K111*2,)","v":0},0,{"$f":"IF(K111>0,\"TOTAL WAGE:\",0)","v":"TOTAL WAGE:"},{"$f":"N111+N112","v":0},{"$f":"N113","v":0},{"$f":"IF('Filtered Information'!$B$1>=A111,\"NO\",\"YES\")","v":"YES"}]
[{"$f":"IFERROR(VLOOKUP(A111,'Filtered Information'!$A$3:$E$64,5,FALSE),\"-\")","v":"-"},"SHOW",null,null,null,null,null,null,null,0,null,0,null,null,null,{"$f":"IF('Filtered Information'!$B$1>=A111,\"NO\",\"YES\")","v":"YES"}]
[null,"M.P.",null,null,null,null,null,null,null,0,{"$f":"IF(J115>0,K111,)","v":0},0,{"$f":"IF(K111>0,\"UNION 3.5%:\",0)","v":"UNION 3.5%:"},{"$f":"N113*0.035","v":0},null,{"$f":"IF('Filtered Information'!$B$1>=A111,\"NO\",\"YES\")","v":"YES"}]
[{"$f":"A111+1","v":22},"REG.",null,null,null,null,null,null,null,0,{"$f":"IFERROR(VLOOKUP(A116,'Filtered Information'!$A$3:$D$64,2,FALSE),\"0\")","v":"0"},0,{"$f":"IF(K116>0,\"SUBTOTAL:\",0)","v":"SUBTOTAL:"},{"$f":"SUM(L116:L120)","v":0},null,{"$f":"IF('Filtered Information'!$B$1>=A116,\"NO\",\"YES\")","v":"YES"}]
[{"$f":"IFERROR(VLOOKUP(A116,'Filtered Information'!$A$3:$E$66,4,FALSE),\"-\")","v":"-"},"O.T.",null,null,null,null,null,null,null,0,{"$f":"IF(J117>0,K116*1.5,)","v":0},0,"VACATION 8%:",{"$f":"N116*0.08","v":0},null,{"$f":"IF('Filtered Information'!$B$1>=A116,\"NO\",\"YES\")","v":"YES"}]
[{"$f":"IFERROR(VLOOKUP(A116,'Filtered Information'!$A$3:$E$66,3,FALSE),\"-\")","v":"-"},"D.T.",null,null,null,null,null,null,null,0,{"$f":"IF(J118>0,K116*2,)","v":0},0,{"$f":"IF(K116>0,\"TOTAL WAGE:\",0)","v":"TOTAL WAGE:"},{"$f":"N116+N117","v":0},{"$f":"N118","v":0},{"$f":"IF('Filtered Information'!$B$1>=A116,\"NO\",\"YES\")","v":"YES"}]
[{"$f":"IFERROR(VLOOKUP(A116,'Filtered Information'!$A$3:$E$64,5,FALSE),\"-\")","v":"-"},"SHOW",null,null,null,null,null,null,null,0,null,0,null,null,null,{"$f":"IF('Filtered Information'!$B$1>=A116,\"NO\",\"YES\")","v":"YES"}]
[null,"M.P.",null,null,null,null,null,null,null,0,{"$f":"IF(J120>0,K116,)","v":0},0,{"$f":"IF(K116>0,\"UNION 3.5%:\",0)","v":"UNION 3.5%:"},{"$f":"N118*0.035","v":0},null,{"$f":"IF('Filtered Information'!$B$1>=A116,\"NO\",\"YES\")","v":"YES"}]
[{"$f":"A116+1","v":23},"REG.",null,null,null,null,null,null,null,{"$f":"SUM(C121:I121)","v":0},{"$f":"IFERROR(VLOOKUP(A121,'Filtered Information'!$A$3:$D$64,2,FALSE),\"0\")","v":"0"},{"$f":"J121*K121","v":0},{"$f":"IF(K121>0,\"SUBTOTAL:\",0)","v":"SUBTOTAL:"},{"$f":"SUM(L121:L125)","v":0},null,{"$f":"IF('Filtered Information'!$B$1>=A121,\"NO\",\"YES\")","v":"YES"}]
[{"$f":"IFERROR(VLOOKUP(A121,'Filtered Information'!$A$3:$E$66,4,FALSE),\"-\")","v":"-"},"O.T.",null,null,null,null,null,null,null,0,{"$f":"IF(J122>0,K121*1.5,)","v":0},0,"VACATION 8%:",{"$f":"N121*0.08","v":0},null,{"$f":"IF('Filtered Information'!$B$1>=A121,\"NO\",\"YES\")","v":"YES"}]
[{"$f":"IFERROR(VLOOKUP(A121,'Filtered Information'!$A$3:$E$66,3,FALSE),\"-\")","v":"-"},"D.T.",null,null,null,null,null,null,null,0,{"$f":"IF(J123>0,K121*2,)","v":0},0,{"$f":"IF(K121>0,\"TOTAL WAGE:\",0)","v":"TOTAL WAGE:"},{"$f":"N121+N122","v":0},{"$f":"N123","v":0},{"$f":"IF('Filtered Information'!$B$1>=A121,\"NO\",\"YES\")","v":"YES"}]
[{"$f":"IFERROR(VLOOKUP(A121,'Filtered Information'!$A$3:$E$64,5,FALSE),\"-\")","v":"-"},"SHOW",null,null,null,null,null,null,null,0,null,0,null,null,null,{"$f":"IF('Filtered Information'!$B$1>=A121,\"NO\",\"YES\")","v":"YES"}]
[null,"M.P.",null,null,null,null,null,null,null,0,{"$f":"IF(J125>0,K121,)","v":0},0,{"$f":"IF(K121>0,\"UNION 3.5%:\",0)","v":"UNION 3.5%:"},{"$f":"N123*0.035","v":0},null,{"$f":"IF('Filtered Information'!$B$1>=A121,\"NO\",\"YES\")","v":"YES"}]
[{"$f":"A121+1","v":24},"REG.",null,null,null,null,null,null,null,0,{"$f":"IFERROR(VLOOKUP(A126,'Filtered Information'!$A$3:$D$64,2,FALSE),\"0\")","v":"0"},0,{"$f":"IF(K126>0,\"SUBTOTAL:\",0)","v":"SUBTOTAL:"},{"$f":"SUM(L126:L130)","v":0},null,{"$f":"IF('Filtered Information'!$B$1>=A126,\"NO\",\"YES\")","v":"YES"}]
[{"$f":"IFERROR(VLOOKUP(A126,'Filtered Information'!$A$3:$E$66,4,FALSE),\"-\")","v":"-"},"O.T.",null,null,null,null,null,null,null,0,{"$f":"IF(J127>0,K126*1.5,)","v":0},0,"VACATION 8%:",{"$f":"N126*0.08","v":0},null,{"$f":"IF('Filtered Information'!$B$1>=A126,\"NO\",\"YES\")","v":"YES"}]
[{"$f":"IFERROR(VLOOKUP(A126,'Filtered Information'!$A$3:$E$66,3,FALSE),\"-\")","v":"-"},"D.T.",null,null,null,null,null,null,null,0,{"$f":"IF(J128>0,K126*2,)","v":0},0,{"$f":"IF(K126>0,\"TOTAL WAGE:\",0)","v":"TOTAL WAGE:"},{"$f":"N126+N127","v":0},{"$f":"N128","v":0},{"$f":"IF('Filtered Information'!$B$1>=A126,\"NO\",\"YES\")","v":"YES"}]
[{"$f":"IFERROR(VLOOKUP(A126,'Filtered Information'!$A$3:$E$64,5,FALSE),\"-\")","v":"-"},"SHOW",null,null,null,null,null,null,null,0,null,0,null,null,null,{"$f":"IF('Filtered Information'!$B$1>=A126,\"NO\",\"YES\")","v":"YES"}]
[null,"M.P.",null,null,null,null,null,null,null,0,{"$f":"IF(J130>0,K126,)","v":0},0,{"$f":"IF(K126>0,\"UNION 3.5%:\",0)","v":"UNION 3.5%:"},{"$f":"N128*0.035","v":0},null,{"$f":"IF('Filtered Information'!$B$1>=A126,\"NO\",\"YES\")","v":"YES"}]
[{"$f":"A126+1","v":25},"REG.",null,null,null,null,null,null,null,0,{"$f":"IFERROR(VLOOKUP(A131,'Filtered Information'!$A$3:$D$64,2,FALSE),\"0\")","v":"0"},0,{"$f":"IF(K131>0,\"SUBTOTAL:\",0)","v":"SUBTOTAL:"},{"$f":"SUM(L131:L135)","v":0},null,{"$f":"IF('Filtered Information'!$B$1>=A131,\"NO\",\"YES\")","v":"YES"}]
[{"$f":"IFERROR(VLOOKUP(A131,'Filtered Information'!$A$3:$E$66,4,FALSE),\"-\")","v":"-"},"O.T.",null,null,null,null,null,null,null,0,{"$f":"IF(J132>0,K131*1.5,)","v":0},0,"VACATION 8%:",{"$f":"N131*0.08","v":0},null,{"$f":"IF('Filtered Information'!$B$1>=A131,\"NO\",\"YES\")","v":"YES"}]
[{"$f":"IFERROR(VLOOKUP(A131,'Filtered Information'!$A$3:$E$66,3,FALSE),\"-\")","v":"-"},"D.T.",null,null,null,null,null,null,null,0,{"$f":"IF(J133>0,K131*2,)","v":0},0,{"$f":"IF(K131>0,\"TOTAL WAGE:\",0)","v":"TOTAL WAGE:"},{"$f":"N131+N132","v":0},{"$f":"N133","v":0},{"$f":"IF('Filtered Information'!$B$1>=A131,\"NO\",\"YES\")","v":"YES"}]
[{"$f":"IFERROR(VLOOKUP(A131,'Filtered Information'!$A$3:$E$64,5,FALSE),\"-\")","v":"-"},"SHOW",null,null,null,null,null,null,null,0,null,0,null,null,null,{"$f":"IF('Filtered Information'!$B$1>=A131,\"NO\",\"YES\")","v":"YES"}]
[null,"M.P.",null,null,null,null,null,null,null,0,{"$f":"IF(J135>0,K131,)","v":0},0,{"$f":"IF(K131>0,\"UNION 3.5%:\",0)","v":"UNION 3.5%:"},{"$f":"N133*0.035","v":0},null,{"$f":"IF('Filtered Information'!$B$1>=A131,\"NO\",\"YES\")","v":"YES"}]
[{"$f":"A131+1","v":26},"REG.",null,null,null,null,null,null,null,0,{"$f":"IFERROR(VLOOKUP(A136,'Filtered Information'!$A$3:$D$64,2,FALSE),\"0\")","v":"0"},0,{"$f":"IF(K136>0,\"SUBTOTAL:\",0)","v":"SUBTOTAL:"},{"$f":"SUM(L136:L140)","v":0},null,{"$f":"IF('Filtered Information'!$B$1>=A136,\"NO\",\"YES\")","v":"YES"}]
[{"$f":"IFERROR(VLOOKUP(A136,'Filtered Information'!$A$3:$E$66,4,FALSE),\"-\")","v":"-"},"O.T.",null,null,null,null,null,null,null,0,{"$f":"IF(J137>0,K136*1.5,)","v":0},0,"VACATION 8%:",{"$f":"N136*0.08","v":0},null,{"$f":"IF('Filtered Information'!$B$1>=A136,\"NO\",\"YES\")","v":"YES"}]
[{"$f":"IFERROR(VLOOKUP(A136,'Filtered Information'!$A$3:$E$66,3,FALSE),\"-\")","v":"-"},"D.T.",null,null,null,null,null,null,null,0,{"$f":"IF(J138>0,K136*2,)","v":0},0,{"$f":"IF(K136>0,\"TOTAL WAGE:\",0)","v":"TOTAL WAGE:"},{"$f":"N136+N137","v":0},{"$f":"N138","v":0},{"$f":"IF('Filtered Information'!$B$1>=A136,\"NO\",\"YES\")","v":"YES"}]
[{"$f":"IFERROR(VLOOKUP(A136,'Filtered Information'!$A$3:$E$64,5,FALSE),\"-\")","v":"-"},"SHOW",null,null,null,null,null,null,null,0,null,0,null,null,null,{"$f":"IF('Filtered Information'!$B$1>=A136,\"NO\",\"YES\")","v":"YES"}]
[null,"M.P.",null,null,null,null,null,null,null,0,{"$f":"IF(J140>0,K136,)","v":0},0,{"$f":"IF(K136>0,\"UNION 3.5%:\",0)","v":"UNION 3.5%:"},{"$f":"N138*0.035","v":0},null,{"$f":"IF('Filtered Information'!$B$1>=A136,\"NO\",\"YES\")","v":"YES"}]
[{"$f":"A136+1","v":27},"REG.",null,null,null,null,null,null,null,0,{"$f":"IFERROR(VLOOKUP(A141,'Filtered Information'!$A$3:$D$64,2,FALSE),\"0\")","v":"0"},0,{"$f":"IF(K141>0,\"SUBTOTAL:\",0)","v":"SUBTOTAL:"},{"$f":"SUM(L141:L145)","v":0},null,{"$f":"IF('Filtered Information'!$B$1>=A141,\"NO\",\"YES\")","v":"YES"}]
[{"$f":"IFERROR(VLOOKUP(A141,'Filtered Information'!$A$3:$E$66,4,FALSE),\"-\")","v":"-"},"O.T.",null,null,null,null,null,null,null,0,{"$f":"IF(J142>0,K141*1.5,)","v":0},0,"VACATION 8%:",{"$f":"N141*0.08","v":0},null,{"$f":"IF('Filtered Information'!$B$1>=A141,\"NO\",\"YES\")","v":"YES"}]
[{"$f":"IFERROR(VLOOKUP(A141,'Filtered Information'!$A$3:$E$66,3,FALSE),\"-\")","v":"-"},"D.T.",null,null,null,null,null,null,null,0,{"$f":"IF(J143>0,K141*2,)","v":0},0,{"$f":"IF(K141>0,\"TOTAL WAGE:\",0)","v":"TOTAL WAGE:"},{"$f":"N141+N142","v":0},{"$f":"N143","v":0},{"$f":"IF('Filtered Information'!$B$1>=A141,\"NO\",\"YES\")","v":"YES"}]
[{"$f":"IFERROR(VLOOKUP(A141,'Filtered Information'!$A$3:$E$64,5,FALSE),\"-\")","v":"-"},"SHOW",null,null,null,null,null,null,null,0,null,0,null,null,null,{"$f":"IF('Filtered Information'!$B$1>=A141,\"NO\",\"YES\")","v":"YES"}]
[null,"M.P.",null,null,null,null,null,null,null,0,{"$f":"IF(J145>0,K141,)","v":0},0,{"$f":"IF(K141>0,\"UNION 3.5%:\",0)","v":"UNION 3.5%:"},{"$f":"N143*0.035","v":0},null,{"$f":"IF('Filtered Information'!$B$1>=A141,\"NO\",\"YES\")","v":"YES"}]
[{"$f":"A141+1","v":28},"REG.",null,null,null,null,null,null,null,0,{"$f":"IFERROR(VLOOKUP(A146,'Filtered Information'!$A$3:$D$64,2,FALSE),\"0\")","v":"0"},0,{"$f":"IF(K146>0,\"SUBTOTAL:\",0)","v":"SUBTOTAL:"},{"$f":"SUM(L146:L150)","v":0},null,{"$f":"IF('Filtered Information'!$B$1>=A146,\"NO\",\"YES\")","v":"YES"}]
[{"$f":"IFERROR(VLOOKUP(A146,'Filtered Information'!$A$3:$E$66,4,FALSE),\"-\")","v":"-"},"O.T.",null,null,null,null,null,null,null,0,{"$f":"IF(J147>0,K146*1.5,)","v":0},0,"VACATION 8%:",{"$f":"N146*0.08","v":0},null,{"$f":"IF('Filtered Information'!$B$1>=A146,\"NO\",\"YES\")","v":"YES"}]
[{"$f":"IFERROR(VLOOKUP(A146,'Filtered Information'!$A$3:$E$66,3,FALSE),\"-\")","v":"-"},"D.T.",null,null,null,null,null,null,null,0,{"$f":"IF(J148>0,K146*2,)","v":0},0,{"$f":"IF(K146>0,\"TOTAL WAGE:\",0)","v":"TOTAL WAGE:"},{"$f":"N146+N147","v":0},{"$f":"N148","v":0},{"$f":"IF('Filtered Information'!$B$1>=A146,\"NO\",\"YES\")","v":"YES"}]
[{"$f":"IFERROR(VLOOKUP(A146,'Filtered Information'!$A$3:$E$64,5,FALSE),\"-\")","v":"-"},"SHOW",null,null,null,null,null,null,null,0,null,0,null,null,null,{"$f":"IF('Filtered Information'!$B$1>=A146,\"NO\",\"YES\")","v":"YES"}]
[null,"M.P.",null,null,null,null,null,null,null,0,{"$f":"IF(J150>0,K146,)","v":0},0,{"$f":"IF(K146>0,\"UNION 3.5%:\",0)","v":"UNION 3.5%:"},{"$f":"N148*0.035","v":0},null,{"$f":"IF('Filtered Information'!$B$1>=A146,\"NO\",\"YES\")","v":"YES"}]
[{"$f":"A146+1","v":29},"REG.",null,null,null,null,null,null,null,0,{"$f":"IFERROR(VLOOKUP(A151,'Filtered Information'!$A$3:$D$64,2,FALSE),\"0\")","v":"0"},0,{"$f":"IF(K151>0,\"SUBTOTAL:\",0)","v":"SUBTOTAL:"},{"$f":"SUM(L151:L155)","v":0},null,{"$f":"IF('Filtered Information'!$B$1>=A151,\"NO\",\"YES\")","v":"YES"}]
[{"$f":"IFERROR(VLOOKUP(A151,'Filtered Information'!$A$3:$E$66,4,FALSE),\"-\")","v":"-"},"O.T.",null,null,null,null,null,null,null,0,{"$f":"IF(J152>0,K151*1.5,)","v":0},0,"VACATION 8%:",{"$f":"N151*0.08","v":0},null,{"$f":"IF('Filtered Information'!$B$1>=A151,\"NO\",\"YES\")","v":"YES"}]
[{"$f":"IFERROR(VLOOKUP(A151,'Filtered Information'!$A$3:$E$66,3,FALSE),\"-\")","v":"-"},"D.T.",null,null,null,null,null,null,null,{"$f":"SUM(C153:I153)","v":0},{"$f":"IF(J153>0,K151*2,)","v":0},{"$f":"J153*K153","v":0},{"$f":"IF(K151>0,\"TOTAL WAGE:\",0)","v":"TOTAL WAGE:"},{"$f":"N151+N152","v":0},{"$f":"N153","v":0},{"$f":"IF('Filtered Information'!$B$1>=A151,\"NO\",\"YES\")","v":"YES"}]
[{"$f":"IFERROR(VLOOKUP(A151,'Filtered Information'!$A$3:$E$64,5,FALSE),\"-\")","v":"-"},"SHOW",null,null,null,null,null,null,null,0,null,0,null,null,null,{"$f":"IF('Filtered Information'!$B$1>=A151,\"NO\",\"YES\")","v":"YES"}]
[null,"M.P.",null,null,null,null,null,null,null,0,{"$f":"IF(J155>0,K151,)","v":0},0,{"$f":"IF(K151>0,\"UNION 3.5%:\",0)","v":"UNION 3.5%:"},{"$f":"N153*0.035","v":0},null,{"$f":"IF('Filtered Information'!$B$1>=A151,\"NO\",\"YES\")","v":"YES"}]
[{"$f":"A151+1","v":30},"REG.",null,null,null,null,null,null,null,0,{"$f":"IFERROR(VLOOKUP(A156,'Filtered Information'!$A$3:$D$64,2,FALSE),\"0\")","v":"0"},0,{"$f":"IF(K156>0,\"SUBTOTAL:\",0)","v":"SUBTOTAL:"},{"$f":"SUM(L156:L160)","v":0},null,{"$f":"IF('Filtered Information'!$B$1>=A156,\"NO\",\"YES\")","v":"YES"}]
[{"$f":"IFERROR(VLOOKUP(A156,'Filtered Information'!$A$3:$E$66,4,FALSE),\"-\")","v":"-"},"O.T.",null,null,null,null,null,null,null,0,{"$f":"IF(J157>0,K156*1.5,)","v":0},0,"VACATION 8%:",{"$f":"N156*0.08","v":0},null,{"$f":"IF('Filtered Information'!$B$1>=A156,\"NO\",\"YES\")","v":"YES"}]
[{"$f":"IFERROR(VLOOKUP(A156,'Filtered Information'!$A$3:$E$66,3,FALSE),\"-\")","v":"-"},"D.T.",null,null,null,null,null,null,null,0,{"$f":"IF(J158>0,K156*2,)","v":0},0,{"$f":"IF(K156>0,\"TOTAL WAGE:\",0)","v":"TOTAL WAGE:"},{"$f":"N156+N157","v":0},{"$f":"N158","v":0},{"$f":"IF('Filtered Information'!$B$1>=A156,\"NO\",\"YES\")","v":"YES"}]
[{"$f":"IFERROR(VLOOKUP(A156,'Filtered Information'!$A$3:$E$64,5,FALSE),\"-\")","v":"-"},"SHOW",null,null,null,null,null,null,null,0,null,0,null,null,null,{"$f":"IF('Filtered Information'!$B$1>=A156,\"NO\",\"YES\")","v":"YES"}]
[null,"M.P.",null,null,null,null,null,null,null,0,{"$f":"IF(J160>0,K156,)","v":0},0,{"$f":"IF(K156>0,\"UNION 3.5%:\",0)","v":"UNION 3.5%:"},{"$f":"N158*0.035","v":0},null,{"$f":"IF('Filtered Information'!$B$1>=A156,\"NO\",\"YES\")","v":"YES"}]
[{"$f":"A156+1","v":31},"REG.",null,null,null,null,null,null,null,0,{"$f":"IFERROR(VLOOKUP(A161,'Filtered Information'!$A$3:$D$64,2,FALSE),\"0\")","v":"0"},0,{"$f":"IF(K161>0,\"SUBTOTAL:\",0)","v":"SUBTOTAL:"},{"$f":"SUM(L161:L165)","v":0},null,{"$f":"IF('Filtered Information'!$B$1>=A161,\"NO\",\"YES\")","v":"YES"}]
[{"$f":"IFERROR(VLOOKUP(A161,'Filtered Information'!$A$3:$E$66,4,FALSE),\"-\")","v":"-"},"O.T.",null,null,null,null,null,null,null,0,{"$f":"IF(J162>0,K161*1.5,)","v":0},0,"VACATION 8%:",{"$f":"N161*0.08","v":0},null,{"$f":"IF('Filtered Information'!$B$1>=A161,\"NO\",\"YES\")","v":"YES"}]
[{"$f":"IFERROR(VLOOKUP(A161,'Filtered Information'!$A$3:$E$66,3,FALSE),\"-\")","v":"-"},"D.T.",null,null,null,null,null,null,null,0,{"$f":"IF(J163>0,K161*2,)","v":0},0,{"$f":"IF(K161>0,\"TOTAL WAGE:\",0)","v":"TOTAL WAGE:"},{"$f":"N161+N162","v":0},{"$f":"N163","v":0},{"$f":"IF('Filtered Information'!$B$1>=A161,\"NO\",\"YES\")","v":"YES"}]
[{"$f":"IFERROR(VLOOKUP(A161,'Filtered Information'!$A$3:$E$64,5,FALSE),\"-\")","v":"-"},"SHOW",null,null,null,null,null,null,null,0,null,0,null,null,null,{"$f":"IF('Filtered Information'!$B$1>=A161,\"NO\",\"YES\")","v":"YES"}]
[null,"M.P.",null,null,null,null,null,null,null,0,{"$f":"IF(J165>0,K161,)","v":0},0,{"$f":"IF(K161>0,\"UNION 3.5%:\",0)","v":"UNION 3.5%:"},{"$f":"N163*0.035","v":0},null,{"$f":"IF('Filtered Information'!$B$1>=A161,\"NO\",\"YES\")","v":"YES"}]
[{"$f":"A161+1","v":32},"REG.",null,null,null,null,null,null,null,0,{"$f":"IFERROR(VLOOKUP(A166,'Filtered Information'!$A$3:$D$64,2,FALSE),\"0\")","v":"0"},0,{"$f":"IF(K166>0,\"SUBTOTAL:\",0)","v":"SUBTOTAL:"},{"$f":"SUM(L166:L170)","v":0},null,{"$f":"IF('Filtered Information'!$B$1>=A166,\"NO\",\"YES\")","v":"YES"}]
[{"$f":"IFERROR(VLOOKUP(A166,'Filtered Information'!$A$3:$E$66,4,FALSE),\"-\")","v":"-"},"O.T.",null,null,null,null,null,null,null,0,{"$f":"IF(J167>0,K166*1.5,)","v":0},0,"VACATION 8%:",{"$f":"N166*0.08","v":0},null,{"$f":"IF('Filtered Information'!$B$1>=A166,\"NO\",\"YES\")","v":"YES"}]
[{"$f":"IFERROR(VLOOKUP(A166,'Filtered Information'!$A$3:$E$66,3,FALSE),\"-\")","v":"-"},"D.T.",null,null,null,null,null,null,null,0,{"$f":"IF(J168>0,K166*2,)","v":0},0,{"$f":"IF(K166>0,\"TOTAL WAGE:\",0)","v":"TOTAL WAGE:"},{"$f":"N166+N167","v":0},{"$f":"N168","v":0},{"$f":"IF('Filtered Information'!$B$1>=A166,\"NO\",\"YES\")","v":"YES"}]
[{"$f":"IFERROR(VLOOKUP(A166,'Filtered Information'!$A$3:$E$64,5,FALSE),\"-\")","v":"-"},"SHOW",null,null,null,null,null,null,null,0,null,0,null,null,null,{"$f":"IF('Filtered Information'!$B$1>=A166,\"NO\",\"YES\")","v":"YES"}]
[null,"M.P.",null,null,null,null,null,null,null,0,{"$f":"IF(J170>0,K166,)","v":0},0,{"$f":"IF(K166>0,\"UNION 3.5%:\",0)","v":"UNION 3.5%:"},{"$f":"N168*0.035","v":0},null,{"$f":"IF('Filtered Information'!$B$1>=A166,\"NO\",\"YES\")","v":"YES"}]
[{"$f":"A166+1","v":33},"REG.",null,null,null,null,null,null,null,0,{"$f":"IFERROR(VLOOKUP(A171,'Filtered Information'!$A$3:$D$64,2,FALSE),\"0\")","v":"0"},0,{"$f":"IF(K171>0,\"SUBTOTAL:\",0)","v":"SUBTOTAL:"},{"$f":"SUM(L171:L175)","v":0},null,{"$f":"IF('Filtered Information'!$B$1>=A171,\"NO\",\"YES\")","v":"YES"}]
[{"$f":"IFERROR(VLOOKUP(A171,'Filtered Information'!$A$3:$E$66,4,FALSE),\"-\")","v":"-"},"O.T.",null,null,null,null,null,null,null,0,{"$f":"IF(J172>0,K171*1.5,)","v":0},0,"VACATION 8%:",{"$f":"N171*0.08","v":0},null,{"$f":"IF('Filtered Information'!$B$1>=A171,\"NO\",\"YES\")","v":"YES"}]
[{"$f":"IFERROR(VLOOKUP(A171,'Filtered Information'!$A$3:$E$66,3,FALSE),\"-\")","v":"-"},"D.T.",null,null,null,null,null,null,null,0,{"$f":"IF(J173>0,K171*2,)","v":0},0,{"$f":"IF(K171>0,\"TOTAL WAGE:\",0)","v":"TOTAL WAGE:"},{"$f":"N171+N172","v":0},{"$f":"N173","v":0},{"$f":"IF('Filtered Information'!$B$1>=A171,\"NO\",\"YES\")","v":"YES"}]
[{"$f":"IFERROR(VLOOKUP(A171,'Filtered Information'!$A$3:$E$64,5,FALSE),\"-\")","v":"-"},"SHOW",null,null,null,null,null,null,null,0,null,0,null,null,null,{"$f":"IF('Filtered Information'!$B$1>=A171,\"NO\",\"YES\")","v":"YES"}]
[null,"M.P.",null,null,null,null,null,null,null,0,{"$f":"IF(J175>0,K171,)","v":0},0,{"$f":"IF(K171>0,\"UNION 3.5%:\",0)","v":"UNION 3.5%:"},{"$f":"N173*0.035","v":0},null,{"$f":"IF('Filtered Information'!$B$1>=A171,\"NO\",\"YES\")","v":"YES"}]
[{"$f":"A171+1","v":34},"REG.",null,null,null,null,null,null,null,0,{"$f":"IFERROR(VLOOKUP(A176,'Filtered Information'!$A$3:$D$64,2,FALSE),\"0\")","v":"0"},0,{"$f":"IF(K176>0,\"SUBTOTAL:\",0)","v":"SUBTOTAL:"},{"$f":"SUM(L176:L180)","v":0},null,{"$f":"IF('Filtered Information'!$B$1>=A176,\"NO\",\"YES\")","v":"YES"}]
[{"$f":"IFERROR(VLOOKUP(A176,'Filtered Information'!$A$3:$E$66,4,FALSE),\"-\")","v":"-"},"O.T.",null,null,null,null,null,null,null,0,{"$f":"IF(J177>0,K176*1.5,)","v":0},0,"VACATION 8%:",{"$f":"N176*0.08","v":0},null,{"$f":"IF('Filtered Information'!$B$1>=A176,\"NO\",\"YES\")","v":"YES"}]
[{"$f":"IFERROR(VLOOKUP(A176,'Filtered Information'!$A$3:$E$66,3,FALSE),\"-\")","v":"-"},"D.T.",null,null,null,null,null,null,null,0,{"$f":"IF(J178>0,K176*2,)","v":0},0,{"$f":"IF(K176>0,\"TOTAL WAGE:\",0)","v":"TOTAL WAGE:"},{"$f":"N176+N177","v":0},{"$f":"N178","v":0},{"$f":"IF('Filtered Information'!$B$1>=A176,\"NO\",\"YES\")","v":"YES"}]
[{"$f":"IFERROR(VLOOKUP(A176,'Filtered Information'!$A$3:$E$64,5,FALSE),\"-\")","v":"-"},"SHOW",null,null,null,null,null,null,null,0,null,0,null,null,null,{"$f":"IF('Filtered Information'!$B$1>=A176,\"NO\",\"YES\")","v":"YES"}]
[null,"M.P.",null,null,null,null,null,null,null,0,{"$f":"IF(J180>0,K176,)","v":0},0,{"$f":"IF(K176>0,\"UNION 3.5%:\",0)","v":"UNION 3.5%:"},{"$f":"N178*0.035","v":0},null,{"$f":"IF('Filtered Information'!$B$1>=A176,\"NO\",\"YES\")","v":"YES"}]
[{"$f":"A176+1","v":35},"REG.",null,null,null,null,null,null,null,0,{"$f":"IFERROR(VLOOKUP(A181,'Filtered Information'!$A$3:$D$64,2,FALSE),\"0\")","v":"0"},0,{"$f":"IF(K181>0,\"SUBTOTAL:\",0)","v":"SUBTOTAL:"},{"$f":"SUM(L181:L185)","v":0},null,{"$f":"IF('Filtered Information'!$B$1>=A181,\"NO\",\"YES\")","v":"YES"}]
[{"$f":"IFERROR(VLOOKUP(A181,'Filtered Information'!$A$3:$E$66,4,FALSE),\"-\")","v":"-"},"O.T.",null,null,null,null,null,null,null,0,{"$f":"IF(J182>0,K181*1.5,)","v":0},0,"VACATION 8%:",{"$f":"N181*0.08","v":0},null,{"$f":"IF('Filtered Information'!$B$1>=A181,\"NO\",\"YES\")","v":"YES"}]
[{"$f":"IFERROR(VLOOKUP(A181,'Filtered Information'!$A$3:$E$66,3,FALSE),\"-\")","v":"-"},"D.T.",null,null,null,null,null,null,null,0,{"$f":"IF(J183>0,K181*2,)","v":0},0,{"$f":"IF(K181>0,\"TOTAL WAGE:\",0)","v":"TOTAL WAGE:"},{"$f":"N181+N182","v":0},{"$f":"N183","v":0},{"$f":"IF('Filtered Information'!$B$1>=A181,\"NO\",\"YES\")","v":"YES"}]
[{"$f":"IFERROR(VLOOKUP(A181,'Filtered Information'!$A$3:$E$64,5,FALSE),\"-\")","v":"-"},"SHOW",null,null,null,null,null,null,null,0,null,0,null,null,null,{"$f":"IF('Filtered Information'!$B$1>=A181,\"NO\",\"YES\")","v":"YES"}]
[null,"M.P.",null,null,null,null,null,null,null,{"$f":"SUM(C185:I185)","v":0},{"$f":"IF(J185>0,K181,)","v":0},{"$f":"J185*K185","v":0},{"$f":"IF(K181>0,\"UNION 3.5%:\",0)","v":"UNION 3.5%:"},{"$f":"N183*0.035","v":0},null,{"$f":"IF('Filtered Information'!$B$1>=A181,\"NO\",\"YES\")","v":"YES"}]
[{"$f":"A181+1","v":36},"REG.",null,null,null,null,null,null,null,0,{"$f":"IFERROR(VLOOKUP(A186,'Filtered Information'!$A$3:$D$64,2,FALSE),\"0\")","v":"0"},0,{"$f":"IF(K186>0,\"SUBTOTAL:\",0)","v":"SUBTOTAL:"},{"$f":"SUM(L186:L190)","v":0},null,{"$f":"IF('Filtered Information'!$B$1>=A186,\"NO\",\"YES\")","v":"YES"}]
[{"$f":"IFERROR(VLOOKUP(A186,'Filtered Information'!$A$3:$E$66,4,FALSE),\"-\")","v":"-"},"O.T.",null,null,null,null,null,null,null,0,{"$f":"IF(J187>0,K186*1.5,)","v":0},0,"VACATION 8%:",{"$f":"N186*0.08","v":0},null,{"$f":"IF('Filtered Information'!$B$1>=A186,\"NO\",\"YES\")","v":"YES"}]
[{"$f":"IFERROR(VLOOKUP(A186,'Filtered Information'!$A$3:$E$66,3,FALSE),\"-\")","v":"-"},"D.T.",null,null,null,null,null,null,null,0,{"$f":"IF(J188>0,K186*2,)","v":0},0,{"$f":"IF(K186>0,\"TOTAL WAGE:\",0)","v":"TOTAL WAGE:"},{"$f":"N186+N187","v":0},{"$f":"N188","v":0},{"$f":"IF('Filtered Information'!$B$1>=A186,\"NO\",\"YES\")","v":"YES"}]
[{"$f":"IFERROR(VLOOKUP(A186,'Filtered Information'!$A$3:$E$64,5,FALSE),\"-\")","v":"-"},"SHOW",null,null,null,null,null,null,null,0,null,0,null,null,null,{"$f":"IF('Filtered Information'!$B$1>=A186,\"NO\",\"YES\")","v":"YES"}]
[null,"M.P.",null,null,null,null,null,null,null,0,{"$f":"IF(J190>0,K186,)","v":0},0,{"$f":"IF(K186>0,\"UNION 3.5%:\",0)","v":"UNION 3.5%:"},{"$f":"N188*0.035","v":0},null,{"$f":"IF('Filtered Information'!$B$1>=A186,\"NO\",\"YES\")","v":"YES"}]
[{"$f":"A186+1","v":37},"REG.",null,null,null,null,null,null,null,{"$f":"SUM(C191:I191)","v":0},{"$f":"IFERROR(VLOOKUP(A191,'Filtered Information'!$A$3:$D$64,2,FALSE),\"0\")","v":"0"},{"$f":"J191*K191","v":0},{"$f":"IF(K191>0,\"SUBTOTAL:\",0)","v":"SUBTOTAL:"},{"$f":"SUM(L191:L195)","v":0},null,{"$f":"IF('Filtered Information'!$B$1>=A191,\"NO\",\"YES\")","v":"YES"}]
[{"$f":"IFERROR(VLOOKUP(A191,'Filtered Information'!$A$3:$E$66,4,FALSE),\"-\")","v":"-"},"O.T.",null,null,null,null,null,null,null,0,{"$f":"IF(J192>0,K191*1.5,)","v":0},0,"VACATION 8%:",{"$f":"N191*0.08","v":0},null,{"$f":"IF('Filtered Information'!$B$1>=A191,\"NO\",\"YES\")","v":"YES"}]
[{"$f":"IFERROR(VLOOKUP(A191,'Filtered Information'!$A$3:$E$66,3,FALSE),\"-\")","v":"-"},"D.T.",null,null,null,null,null,null,null,0,{"$f":"IF(J193>0,K191*2,)","v":0},0,{"$f":"IF(K191>0,\"TOTAL WAGE:\",0)","v":"TOTAL WAGE:"},{"$f":"N191+N192","v":0},{"$f":"N193","v":0},{"$f":"IF('Filtered Information'!$B$1>=A191,\"NO\",\"YES\")","v":"YES"}]
[{"$f":"IFERROR(VLOOKUP(A191,'Filtered Information'!$A$3:$E$64,5,FALSE),\"-\")","v":"-"},"SHOW",null,null,null,null,null,null,null,0,null,0,null,null,null,{"$f":"IF('Filtered Information'!$B$1>=A191,\"NO\",\"YES\")","v":"YES"}]
[null,"M.P.",null,null,null,null,null,null,null,0,{"$f":"IF(J195>0,K191,)","v":0},0,{"$f":"IF(K191>0,\"UNION 3.5%:\",0)","v":"UNION 3.5%:"},{"$f":"N193*0.035","v":0},null,{"$f":"IF('Filtered Information'!$B$1>=A191,\"NO\",\"YES\")","v":"YES"}]
[{"$f":"A191+1","v":38},"REG.",null,null,null,null,null,null,null,0,{"$f":"IFERROR(VLOOKUP(A196,'Filtered Information'!$A$3:$D$64,2,FALSE),\"0\")","v":"0"},0,{"$f":"IF(K196>0,\"SUBTOTAL:\",0)","v":"SUBTOTAL:"},{"$f":"SUM(L196:L200)","v":0},null,{"$f":"IF('Filtered Information'!$B$1>=A196,\"NO\",\"YES\")","v":"YES"}]
[{"$f":"IFERROR(VLOOKUP(A196,'Filtered Information'!$A$3:$E$66,4,FALSE),\"-\")","v":"-"},"O.T.",null,null,null,null,null,null,null,0,{"$f":"IF(J197>0,K196*1.5,)","v":0},0,"VACATION 8%:",{"$f":"N196*0.08","v":0},null,{"$f":"IF('Filtered Information'!$B$1>=A196,\"NO\",\"YES\")","v":"YES"}]
[{"$f":"IFERROR(VLOOKUP(A196,'Filtered Information'!$A$3:$E$66,3,FALSE),\"-\")","v":"-"},"D.T.",null,null,null,null,null,null,null,0,{"$f":"IF(J198>0,K196*2,)","v":0},0,{"$f":"IF(K196>0,\"TOTAL WAGE:\",0)","v":"TOTAL WAGE:"},{"$f":"N196+N197","v":0},{"$f":"N198","v":0},{"$f":"IF('Filtered Information'!$B$1>=A196,\"NO\",\"YES\")","v":"YES"}]
[{"$f":"IFERROR(VLOOKUP(A196,'Filtered Information'!$A$3:$E$64,5,FALSE),\"-\")","v":"-"},"SHOW",null,null,null,null,null,null,null,0,null,0,null,null,null,{"$f":"IF('Filtered Information'!$B$1>=A196,\"NO\",\"YES\")","v":"YES"}]
[null,"M.P.",null,null,null,null,null,null,null,0,{"$f":"IF(J200>0,K196,)","v":0},0,{"$f":"IF(K196>0,\"UNION 3.5%:\",0)","v":"UNION 3.5%:"},{"$f":"N198*0.035","v":0},null,{"$f":"IF('Filtered Information'!$B$1>=A196,\"NO\",\"YES\")","v":"YES"}]
[{"$f":"A196+1","v":39},"REG.",null,null,null,null,null,null,null,0,{"$f":"IFERROR(VLOOKUP(A201,'Filtered Information'!$A$3:$D$64,2,FALSE),\"0\")","v":"0"},0,{"$f":"IF(K201>0,\"SUBTOTAL:\",0)","v":"SUBTOTAL:"},{"$f":"SUM(L201:L205)","v":0},null,{"$f":"IF('Filtered Information'!$B$1>=A201,\"NO\",\"YES\")","v":"YES"}]
[{"$f":"IFERROR(VLOOKUP(A201,'Filtered Information'!$A$3:$E$66,4,FALSE),\"-\")","v":"-"},"O.T.",null,null,null,null,null,null,null,0,{"$f":"IF(J202>0,K201*1.5,)","v":0},0,"VACATION 8%:",{"$f":"N201*0.08","v":0},null,{"$f":"IF('Filtered Information'!$B$1>=A201,\"NO\",\"YES\")","v":"YES"}]
[{"$f":"IFERROR(VLOOKUP(A201,'Filtered Information'!$A$3:$E$66,3,FALSE),\"-\")","v":"-"},"D.T.",null,null,null,null,null,null,null,0,{"$f":"IF(J203>0,K201*2,)","v":0},0,{"$f":"IF(K201>0,\"TOTAL WAGE:\",0)","v":"TOTAL WAGE:"},{"$f":"N201+N202","v":0},{"$f":"N203","v":0},{"$f":"IF('Filtered Information'!$B$1>=A201,\"NO\",\"YES\")","v":"YES"}]
[{"$f":"IFERROR(VLOOKUP(A201,'Filtered Information'!$A$3:$E$64,5,FALSE),\"-\")","v":"-"},"SHOW",null,null,null,null,null,null,null,0,null,0,null,null,null,{"$f":"IF('Filtered Information'!$B$1>=A201,\"NO\",\"YES\")","v":"YES"}]
[null,"M.P.",null,null,null,null,null,null,null,0,{"$f":"IF(J205>0,K201,)","v":0},0,{"$f":"IF(K201>0,\"UNION 3.5%:\",0)","v":"UNION 3.5%:"},{"$f":"N203*0.035","v":0},null,{"$f":"IF('Filtered Information'!$B$1>=A201,\"NO\",\"YES\")","v":"YES"}]
[{"$f":"A201+1","v":40},"REG.",null,null,null,null,null,null,null,0,{"$f":"IFERROR(VLOOKUP(A206,'Filtered Information'!$A$3:$D$64,2,FALSE),\"0\")","v":"0"},0,{"$f":"IF(K206>0,\"SUBTOTAL:\",0)","v":"SUBTOTAL:"},{"$f":"SUM(L206:L210)","v":0},null,{"$f":"IF('Filtered Information'!$B$1>=A206,\"NO\",\"YES\")","v":"YES"}]
[{"$f":"IFERROR(VLOOKUP(A206,'Filtered Information'!$A$3:$E$66,4,FALSE),\"-\")","v":"-"},"O.T.",null,null,null,null,null,null,null,0,{"$f":"IF(J207>0,K206*1.5,)","v":0},0,"VACATION 8%:",{"$f":"N206*0.08","v":0},null,{"$f":"IF('Filtered Information'!$B$1>=A206,\"NO\",\"YES\")","v":"YES"}]
[{"$f":"IFERROR(VLOOKUP(A206,'Filtered Information'!$A$3:$E$66,3,FALSE),\"-\")","v":"-"},"D.T.",null,null,null,null,null,null,null,0,{"$f":"IF(J208>0,K206*2,)","v":0},0,{"$f":"IF(K206>0,\"TOTAL WAGE:\",0)","v":"TOTAL WAGE:"},{"$f":"N206+N207","v":0},{"$f":"N208","v":0},{"$f":"IF('Filtered Information'!$B$1>=A206,\"NO\",\"YES\")","v":"YES"}]
[{"$f":"IFERROR(VLOOKUP(A206,'Filtered Information'!$A$3:$E$64,5,FALSE),\"-\")","v":"-"},"SHOW",null,null,null,null,null,null,null,0,null,0,null,null,null,{"$f":"IF('Filtered Information'!$B$1>=A206,\"NO\",\"YES\")","v":"YES"}]
[null,"M.P.",null,null,null,null,null,null,null,0,{"$f":"IF(J210>0,K206,)","v":0},0,{"$f":"IF(K206>0,\"UNION 3.5%:\",0)","v":"UNION 3.5%:"},{"$f":"N208*0.035","v":0},null,{"$f":"IF('Filtered Information'!$B$1>=A206,\"NO\",\"YES\")","v":"YES"}]
[{"$f":"A206+1","v":41},"REG.",null,null,null,null,null,null,null,{"$f":"SUM(C211:I211)","v":0},{"$f":"IFERROR(VLOOKUP(A211,'Filtered Information'!$A$3:$D$64,2,FALSE),\"0\")","v":"0"},{"$f":"J211*K211","v":0},{"$f":"IF(K211>0,\"SUBTOTAL:\",0)","v":"SUBTOTAL:"},{"$f":"SUM(L211:L215)","v":0},null,{"$f":"IF('Filtered Information'!$B$1>=A211,\"NO\",\"YES\")","v":"YES"}]
[{"$f":"IFERROR(VLOOKUP(A211,'Filtered Information'!$A$3:$E$66,4,FALSE),\"-\")","v":"-"},"O.T.",null,null,null,null,null,null,null,0,{"$f":"IF(J212>0,K211*1.5,)","v":0},0,"VACATION 8%:",{"$f":"N211*0.08","v":0},null,{"$f":"IF('Filtered Information'!$B$1>=A211,\"NO\",\"YES\")","v":"YES"}]
[{"$f":"IFERROR(VLOOKUP(A211,'Filtered Information'!$A$3:$E$66,3,FALSE),\"-\")","v":"-"},"D.T.",null,null,null,null,null,null,null,0,{"$f":"IF(J213>0,K211*2,)","v":0},0,{"$f":"IF(K211>0,\"TOTAL WAGE:\",0)","v":"TOTAL WAGE:"},{"$f":"N211+N212","v":0},{"$f":"N213","v":0},{"$f":"IF('Filtered Information'!$B$1>=A211,\"NO\",\"YES\")","v":"YES"}]
[{"$f":"IFERROR(VLOOKUP(A211,'Filtered Information'!$A$3:$E$64,5,FALSE),\"-\")","v":"-"},"SHOW",null,null,null,null,null,null,null,0,null,0,null,null,null,{"$f":"IF('Filtered Information'!$B$1>=A211,\"NO\",\"YES\")","v":"YES"}]
[null,"M.P.",null,null,null,null,null,null,null,0,{"$f":"IF(J215>0,K211,)","v":0},0,{"$f":"IF(K211>0,\"UNION 3.5%:\",0)","v":"UNION 3.5%:"},{"$f":"N213*0.035","v":0},null,{"$f":"IF('Filtered Information'!$B$1>=A211,\"NO\",\"YES\")","v":"YES"}]
[{"$f":"A211+1","v":42},"REG.",null,null,null,null,null,null,null,0,{"$f":"IFERROR(VLOOKUP(A216,'Filtered Information'!$A$3:$D$64,2,FALSE),\"0\")","v":"0"},0,{"$f":"IF(K216>0,\"SUBTOTAL:\",0)","v":"SUBTOTAL:"},{"$f":"SUM(L216:L220)","v":0},null,{"$f":"IF('Filtered Information'!$B$1>=A216,\"NO\",\"YES\")","v":"YES"}]
[{"$f":"IFERROR(VLOOKUP(A216,'Filtered Information'!$A$3:$E$66,4,FALSE),\"-\")","v":"-"},"O.T.",null,null,null,null,null,null,null,0,{"$f":"IF(J217>0,K216*1.5,)","v":0},0,"VACATION 8%:",{"$f":"N216*0.08","v":0},null,{"$f":"IF('Filtered Information'!$B$1>=A216,\"NO\",\"YES\")","v":"YES"}]
[{"$f":"IFERROR(VLOOKUP(A216,'Filtered Information'!$A$3:$E$66,3,FALSE),\"-\")","v":"-"},"D.T.",null,null,null,null,null,null,null,0,{"$f":"IF(J218>0,K216*2,)","v":0},0,{"$f":"IF(K216>0,\"TOTAL WAGE:\",0)","v":"TOTAL WAGE:"},{"$f":"N216+N217","v":0},{"$f":"N218","v":0},{"$f":"IF('Filtered Information'!$B$1>=A216,\"NO\",\"YES\")","v":"YES"}]
[{"$f":"IFERROR(VLOOKUP(A216,'Filtered Information'!$A$3:$E$64,5,FALSE),\"-\")","v":"-"},"SHOW",null,null,null,null,null,null,null,0,null,0,null,null,null,{"$f":"IF('Filtered Information'!$B$1>=A216,\"NO\",\"YES\")","v":"YES"}]
[null,"M.P.",null,null,null,null,null,null,null,0,{"$f":"IF(J220>0,K216,)","v":0},0,{"$f":"IF(K216>0,\"UNION 3.5%:\",0)","v":"UNION 3.5%:"},{"$f":"N218*0.035","v":0},null,{"$f":"IF('Filtered Information'!$B$1>=A216,\"NO\",\"YES\")","v":"YES"}]
[{"$f":"A216+1","v":43},"REG.",null,null,null,null,null,null,null,0,{"$f":"IFERROR(VLOOKUP(A221,'Filtered Information'!$A$3:$D$64,2,FALSE),\"0\")","v":"0"},0,{"$f":"IF(K221>0,\"SUBTOTAL:\",0)","v":"SUBTOTAL:"},{"$f":"SUM(L221:L225)","v":0},null,{"$f":"IF('Filtered Information'!$B$1>=A221,\"NO\",\"YES\")","v":"YES"}]
[{"$f":"IFERROR(VLOOKUP(A221,'Filtered Information'!$A$3:$E$66,4,FALSE),\"-\")","v":"-"},"O.T.",null,null,null,null,null,null,null,0,{"$f":"IF(J222>0,K221*1.5,)","v":0},0,"VACATION 8%:",{"$f":"N221*0.08","v":0},null,{"$f":"IF('Filtered Information'!$B$1>=A221,\"NO\",\"YES\")","v":"YES"}]
[{"$f":"IFERROR(VLOOKUP(A221,'Filtered Information'!$A$3:$E$66,3,FALSE),\"-\")","v":"-"},"D.T.",null,null,null,null,null,null,null,0,{"$f":"IF(J223>0,K221*2,)","v":0},0,{"$f":"IF(K221>0,\"TOTAL WAGE:\",0)","v":"TOTAL WAGE:"},{"$f":"N221+N222","v":0},{"$f":"N223","v":0},{"$f":"IF('Filtered Information'!$B$1>=A221,\"NO\",\"YES\")","v":"YES"}]
[{"$f":"IFERROR(VLOOKUP(A221,'Filtered Information'!$A$3:$E$64,5,FALSE),\"-\")","v":"-"},"SHOW",null,null,null,null,null,null,null,0,null,0,null,null,null,{"$f":"IF('Filtered Information'!$B$1>=A221,\"NO\",\"YES\")","v":"YES"}]
[null,"M.P.",null,null,null,null,null,null,null,0,{"$f":"IF(J225>0,K221,)","v":0},0,{"$f":"IF(K221>0,\"UNION 3.5%:\",0)","v":"UNION 3.5%:"},{"$f":"N223*0.035","v":0},null,{"$f":"IF('Filtered Information'!$B$1>=A221,\"NO\",\"YES\")","v":"YES"}]
[{"$f":"A221+1","v":44},"REG.",null,null,null,null,null,null,null,0,{"$f":"IFERROR(VLOOKUP(A226,'Filtered Information'!$A$3:$D$64,2,FALSE),\"0\")","v":"0"},0,{"$f":"IF(K226>0,\"SUBTOTAL:\",0)","v":"SUBTOTAL:"},{"$f":"SUM(L226:L230)","v":0},null,{"$f":"IF('Filtered Information'!$B$1>=A226,\"NO\",\"YES\")","v":"YES"}]
[{"$f":"IFERROR(VLOOKUP(A226,'Filtered Information'!$A$3:$E$66,4,FALSE),\"-\")","v":"-"},"O.T.",null,null,null,null,null,null,null,0,{"$f":"IF(J227>0,K226*1.5,)","v":0},0,"VACATION 8%:",{"$f":"N226*0.08","v":0},null,{"$f":"IF('Filtered Information'!$B$1>=A226,\"NO\",\"YES\")","v":"YES"}]
[{"$f":"IFERROR(VLOOKUP(A226,'Filtered Information'!$A$3:$E$66,3,FALSE),\"-\")","v":"-"},"D.T.",null,null,null,null,null,null,null,0,{"$f":"IF(J228>0,K226*2,)","v":0},0,{"$f":"IF(K226>0,\"TOTAL WAGE:\",0)","v":"TOTAL WAGE:"},{"$f":"N226+N227","v":0},{"$f":"N228","v":0},{"$f":"IF('Filtered Information'!$B$1>=A226,\"NO\",\"YES\")","v":"YES"}]
[{"$f":"IFERROR(VLOOKUP(A226,'Filtered Information'!$A$3:$E$64,5,FALSE),\"-\")","v":"-"},"SHOW",null,null,null,null,null,null,null,0,null,0,null,null,null,{"$f":"IF('Filtered Information'!$B$1>=A226,\"NO\",\"YES\")","v":"YES"}]
[null,"M.P.",null,null,null,null,null,null,null,0,{"$f":"IF(J230>0,K226,)","v":0},0,{"$f":"IF(K226>0,\"UNION 3.5%:\",0)","v":"UNION 3.5%:"},{"$f":"N228*0.035","v":0},null,{"$f":"IF('Filtered Information'!$B$1>=A226,\"NO\",\"YES\")","v":"YES"}]
[{"$f":"A226+1","v":45},"REG.",null,null,null,null,null,null,null,0,{"$f":"IFERROR(VLOOKUP(A231,'Filtered Information'!$A$3:$D$64,2,FALSE),\"0\")","v":"0"},0,{"$f":"IF(K231>0,\"SUBTOTAL:\",0)","v":"SUBTOTAL:"},{"$f":"SUM(L231:L235)","v":0},null,{"$f":"IF('Filtered Information'!$B$1>=A231,\"NO\",\"YES\")","v":"YES"}]
[{"$f":"IFERROR(VLOOKUP(A231,'Filtered Information'!$A$3:$E$66,4,FALSE),\"-\")","v":"-"},"O.T.",null,null,null,null,null,null,null,0,{"$f":"IF(J232>0,K231*1.5,)","v":0},0,"VACATION 8%:",{"$f":"N231*0.08","v":0},null,{"$f":"IF('Filtered Information'!$B$1>=A231,\"NO\",\"YES\")","v":"YES"}]
[{"$f":"IFERROR(VLOOKUP(A231,'Filtered Information'!$A$3:$E$66,3,FALSE),\"-\")","v":"-"},"D.T.",null,null,null,null,null,null,null,0,{"$f":"IF(J233>0,K231*2,)","v":0},0,{"$f":"IF(K231>0,\"TOTAL WAGE:\",0)","v":"TOTAL WAGE:"},{"$f":"N231+N232","v":0},{"$f":"N233","v":0},{"$f":"IF('Filtered Information'!$B$1>=A231,\"NO\",\"YES\")","v":"YES"}]
[{"$f":"IFERROR(VLOOKUP(A231,'Filtered Information'!$A$3:$E$64,5,FALSE),\"-\")","v":"-"},"SHOW",null,null,null,null,null,null,null,0,null,0,null,null,null,{"$f":"IF('Filtered Information'!$B$1>=A231,\"NO\",\"YES\")","v":"YES"}]
[null,"M.P.",null,null,null,null,null,null,null,0,{"$f":"IF(J235>0,K231,)","v":0},0,{"$f":"IF(K231>0,\"UNION 3.5%:\",0)","v":"UNION 3.5%:"},{"$f":"N233*0.035","v":0},null,{"$f":"IF('Filtered Information'!$B$1>=A231,\"NO\",\"YES\")","v":"YES"}]
[{"$f":"A231+1","v":46},"REG.",null,null,null,null,null,null,null,0,{"$f":"IFERROR(VLOOKUP(A236,'Filtered Information'!$A$3:$D$64,2,FALSE),\"0\")","v":"0"},0,{"$f":"IF(K236>0,\"SUBTOTAL:\",0)","v":"SUBTOTAL:"},{"$f":"SUM(L236:L240)","v":0},null,{"$f":"IF('Filtered Information'!$B$1>=A236,\"NO\",\"YES\")","v":"YES"}]
[{"$f":"IFERROR(VLOOKUP(A236,'Filtered Information'!$A$3:$E$66,4,FALSE),\"-\")","v":"-"},"O.T.",null,null,null,null,null,null,null,0,{"$f":"IF(J237>0,K236*1.5,)","v":0},0,"VACATION 8%:",{"$f":"N236*0.08","v":0},null,{"$f":"IF('Filtered Information'!$B$1>=A236,\"NO\",\"YES\")","v":"YES"}]
[{"$f":"IFERROR(VLOOKUP(A236,'Filtered Information'!$A$3:$E$66,3,FALSE),\"-\")","v":"-"},"D.T.",null,null,null,null,null,null,null,0,{"$f":"IF(J238>0,K236*2,)","v":0},0,{"$f":"IF(K236>0,\"TOTAL WAGE:\",0)","v":"TOTAL WAGE:"},{"$f":"N236+N237","v":0},{"$f":"N238","v":0},{"$f":"IF('Filtered Information'!$B$1>=A236,\"NO\",\"YES\")","v":"YES"}]
[{"$f":"IFERROR(VLOOKUP(A236,'Filtered Information'!$A$3:$E$64,5,FALSE),\"-\")","v":"-"},"SHOW",null,null,null,null,null,null,null,0,null,0,null,null,null,{"$f":"IF('Filtered Information'!$B$1>=A236,\"NO\",\"YES\")","v":"YES"}]
[null,"M.P.",null,null,null,null,null,null,null,0,{"$f":"IF(J240>0,K236,)","v":0},0,{"$f":"IF(K236>0,\"UNION 3.5%:\",0)","v":"UNION 3.5%:"},{"$f":"N238*0.035","v":0},null,{"$f":"IF('Filtered Information'!$B$1>=A236,\"NO\",\"YES\")","v":"YES"}]
[{"$f":"A236+1","v":47},"REG.",null,null,null,null,null,null,null,0,{"$f":"IFERROR(VLOOKUP(A241,'Filtered Information'!$A$3:$D$64,2,FALSE),\"0\")","v":"0"},0,{"$f":"IF(K241>0,\"SUBTOTAL:\",0)","v":"SUBTOTAL:"},{"$f":"SUM(L241:L245)","v":0},null,{"$f":"IF('Filtered Information'!$B$1>=A241,\"NO\",\"YES\")","v":"YES"}]
[{"$f":"IFERROR(VLOOKUP(A241,'Filtered Information'!$A$3:$E$66,4,FALSE),\"-\")","v":"-"},"O.T.",null,null,null,null,null,null,null,0,{"$f":"IF(J242>0,K241*1.5,)","v":0},0,"VACATION 8%:",{"$f":"N241*0.08","v":0},null,{"$f":"IF('Filtered Information'!$B$1>=A241,\"NO\",\"YES\")","v":"YES"}]
[{"$f":"IFERROR(VLOOKUP(A241,'Filtered Information'!$A$3:$E$66,3,FALSE),\"-\")","v":"-"},"D.T.",null,null,null,null,null,null,null,{"$f":"SUM(C243:I243)","v":0},{"$f":"IF(J243>0,K241*2,)","v":0},{"$f":"J243*K243","v":0},{"$f":"IF(K241>0,\"TOTAL WAGE:\",0)","v":"TOTAL WAGE:"},{"$f":"N241+N242","v":0},{"$f":"N243","v":0},{"$f":"IF('Filtered Information'!$B$1>=A241,\"NO\",\"YES\")","v":"YES"}]
[{"$f":"IFERROR(VLOOKUP(A241,'Filtered Information'!$A$3:$E$64,5,FALSE),\"-\")","v":"-"},"SHOW",null,null,null,null,null,null,null,0,null,0,null,null,null,{"$f":"IF('Filtered Information'!$B$1>=A241,\"NO\",\"YES\")","v":"YES"}]
[null,"M.P.",null,null,null,null,null,null,null,0,{"$f":"IF(J245>0,K241,)","v":0},0,{"$f":"IF(K241>0,\"UNION 3.5%:\",0)","v":"UNION 3.5%:"},{"$f":"N243*0.035","v":0},null,{"$f":"IF('Filtered Information'!$B$1>=A241,\"NO\",\"YES\")","v":"YES"}]
[{"$f":"A241+1","v":48},"REG.",null,null,null,null,null,null,null,0,{"$f":"IFERROR(VLOOKUP(A246,'Filtered Information'!$A$3:$D$64,2,FALSE),\"0\")","v":"0"},0,{"$f":"IF(K246>0,\"SUBTOTAL:\",0)","v":"SUBTOTAL:"},{"$f":"SUM(L246:L250)","v":0},null,{"$f":"IF('Filtered Information'!$B$1>=A246,\"NO\",\"YES\")","v":"YES"}]
[{"$f":"IFERROR(VLOOKUP(A246,'Filtered Information'!$A$3:$E$66,4,FALSE),\"-\")","v":"-"},"O.T.",null,null,null,null,null,null,null,0,{"$f":"IF(J247>0,K246*1.5,)","v":0},0,"VACATION 8%:",{"$f":"N246*0.08","v":0},null,{"$f":"IF('Filtered Information'!$B$1>=A246,\"NO\",\"YES\")","v":"YES"}]
[{"$f":"IFERROR(VLOOKUP(A246,'Filtered Information'!$A$3:$E$66,3,FALSE),\"-\")","v":"-"},"D.T.",null,null,null,null,null,null,null,0,{"$f":"IF(J248>0,K246*2,)","v":0},0,{"$f":"IF(K246>0,\"TOTAL WAGE:\",0)","v":"TOTAL WAGE:"},{"$f":"N246+N247","v":0},{"$f":"N248","v":0},{"$f":"IF('Filtered Information'!$B$1>=A246,\"NO\",\"YES\")","v":"YES"}]
[{"$f":"IFERROR(VLOOKUP(A246,'Filtered Information'!$A$3:$E$64,5,FALSE),\"-\")","v":"-"},"SHOW",null,null,null,null,null,null,null,0,null,0,null,null,null,{"$f":"IF('Filtered Information'!$B$1>=A246,\"NO\",\"YES\")","v":"YES"}]
[null,"M.P.",null,null,null,null,null,null,null,0,{"$f":"IF(J250>0,K246,)","v":0},0,{"$f":"IF(K246>0,\"UNION 3.5%:\",0)","v":"UNION 3.5%:"},{"$f":"N248*0.035","v":0},null,{"$f":"IF('Filtered Information'!$B$1>=A246,\"NO\",\"YES\")","v":"YES"}]
[{"$f":"A246+1","v":49},"REG.",null,null,null,null,null,null,null,0,{"$f":"IFERROR(VLOOKUP(A251,'Filtered Information'!$A$3:$D$64,2,FALSE),\"0\")","v":"0"},0,{"$f":"IF(K251>0,\"SUBTOTAL:\",0)","v":"SUBTOTAL:"},{"$f":"SUM(L251:L255)","v":0},null,{"$f":"IF('Filtered Information'!$B$1>=A251,\"NO\",\"YES\")","v":"YES"}]
[{"$f":"IFERROR(VLOOKUP(A251,'Filtered Information'!$A$3:$E$66,4,FALSE),\"-\")","v":"-"},"O.T.",null,null,null,null,null,null,null,0,{"$f":"IF(J252>0,K251*1.5,)","v":0},0,"VACATION 8%:",{"$f":"N251*0.08","v":0},null,{"$f":"IF('Filtered Information'!$B$1>=A251,\"NO\",\"YES\")","v":"YES"}]
[{"$f":"IFERROR(VLOOKUP(A251,'Filtered Information'!$A$3:$E$66,3,FALSE),\"-\")","v":"-"},"D.T.",null,null,null,null,null,null,null,0,{"$f":"IF(J253>0,K251*2,)","v":0},0,{"$f":"IF(K251>0,\"TOTAL WAGE:\",0)","v":"TOTAL WAGE:"},{"$f":"N251+N252","v":0},{"$f":"N253","v":0},{"$f":"IF('Filtered Information'!$B$1>=A251,\"NO\",\"YES\")","v":"YES"}]
[{"$f":"IFERROR(VLOOKUP(A251,'Filtered Information'!$A$3:$E$64,5,FALSE),\"-\")","v":"-"},"SHOW",null,null,null,null,null,null,null,0,null,0,null,null,null,{"$f":"IF('Filtered Information'!$B$1>=A251,\"NO\",\"YES\")","v":"YES"}]
[null,"M.P.",null,null,null,null,null,null,null,0,{"$f":"IF(J255>0,K251,)","v":0},0,{"$f":"IF(K251>0,\"UNION 3.5%:\",0)","v":"UNION 3.5%:"},{"$f":"N253*0.035","v":0},null,{"$f":"IF('Filtered Information'!$B$1>=A251,\"NO\",\"YES\")","v":"YES"}]
[{"$f":"A251+1","v":50},"REG.",null,null,null,null,null,null,null,0,{"$f":"IFERROR(VLOOKUP(A256,'Filtered Information'!$A$3:$D$64,2,FALSE),\"0\")","v":"0"},0,{"$f":"IF(K256>0,\"SUBTOTAL:\",0)","v":"SUBTOTAL:"},{"$f":"SUM(L256:L260)","v":0},null,{"$f":"IF('Filtered Information'!$B$1>=A256,\"NO\",\"YES\")","v":"YES"}]
[{"$f":"IFERROR(VLOOKUP(A256,'Filtered Information'!$A$3:$E$66,4,FALSE),\"-\")","v":"-"},"O.T.",null,null,null,null,null,null,null,0,{"$f":"IF(J257>0,K256*1.5,)","v":0},0,"VACATION 8%:",{"$f":"N256*0.08","v":0},null,{"$f":"IF('Filtered Information'!$B$1>=A256,\"NO\",\"YES\")","v":"YES"}]
[{"$f":"IFERROR(VLOOKUP(A256,'Filtered Information'!$A$3:$E$66,3,FALSE),\"-\")","v":"-"},"D.T.",null,null,null,null,null,null,null,0,{"$f":"IF(J258>0,K256*2,)","v":0},0,{"$f":"IF(K256>0,\"TOTAL WAGE:\",0)","v":"TOTAL WAGE:"},{"$f":"N256+N257","v":0},{"$f":"N258","v":0},{"$f":"IF('Filtered Information'!$B$1>=A256,\"NO\",\"YES\")","v":"YES"}]
[{"$f":"IFERROR(VLOOKUP(A256,'Filtered Information'!$A$3:$E$64,5,FALSE),\"-\")","v":"-"},"SHOW",null,null,null,null,null,null,null,0,null,0,null,null,null,{"$f":"IF('Filtered Information'!$B$1>=A256,\"NO\",\"YES\")","v":"YES"}]
[null,"M.P.",null,null,null,null,null,null,null,0,{"$f":"IF(J260>0,K256,)","v":0},0,{"$f":"IF(K256>0,\"UNION 3.5%:\",0)","v":"UNION 3.5%:"},{"$f":"N258*0.035","v":0},null,{"$f":"IF('Filtered Information'!$B$1>=A256,\"NO\",\"YES\")","v":"YES"}]
[{"$f":"A256+1","v":51},"REG.",null,null,null,null,null,null,null,0,{"$f":"IFERROR(VLOOKUP(A261,'Filtered Information'!$A$3:$D$64,2,FALSE),\"0\")","v":"0"},0,{"$f":"IF(K261>0,\"SUBTOTAL:\",0)","v":"SUBTOTAL:"},{"$f":"SUM(L261:L265)","v":0},null,{"$f":"IF('Filtered Information'!$B$1>=A261,\"NO\",\"YES\")","v":"YES"}]
[{"$f":"IFERROR(VLOOKUP(A261,'Filtered Information'!$A$3:$E$66,4,FALSE),\"-\")","v":"-"},"O.T.",null,null,null,null,null,null,null,0,{"$f":"IF(J262>0,K261*1.5,)","v":0},0,"VACATION 8%:",{"$f":"N261*0.08","v":0},null,{"$f":"IF('Filtered Information'!$B$1>=A261,\"NO\",\"YES\")","v":"YES"}]
[{"$f":"IFERROR(VLOOKUP(A261,'Filtered Information'!$A$3:$E$66,3,FALSE),\"-\")","v":"-"},"D.T.",null,null,null,null,null,null,null,0,{"$f":"IF(J263>0,K261*2,)","v":0},0,{"$f":"IF(K261>0,\"TOTAL WAGE:\",0)","v":"TOTAL WAGE:"},{"$f":"N261+N262","v":0},{"$f":"N263","v":0},{"$f":"IF('Filtered Information'!$B$1>=A261,\"NO\",\"YES\")","v":"YES"}]
[{"$f":"IFERROR(VLOOKUP(A261,'Filtered Information'!$A$3:$E$64,5,FALSE),\"-\")","v":"-"},"SHOW",null,null,null,null,null,null,null,0,null,0,null,null,null,{"$f":"IF('Filtered Information'!$B$1>=A261,\"NO\",\"YES\")","v":"YES"}]
[null,"M.P.",null,null,null,null,null,null,null,0,{"$f":"IF(J265>0,K261,)","v":0},0,{"$f":"IF(K261>0,\"UNION 3.5%:\",0)","v":"UNION 3.5%:"},{"$f":"N263*0.035","v":0},null,{"$f":"IF('Filtered Information'!$B$1>=A261,\"NO\",\"YES\")","v":"YES"}]
[{"$f":"A261+1","v":52},"REG.",null,null,null,null,null,null,null,0,{"$f":"IFERROR(VLOOKUP(A266,'Filtered Information'!$A$3:$D$64,2,FALSE),\"0\")","v":"0"},0,{"$f":"IF(K266>0,\"SUBTOTAL:\",0)","v":"SUBTOTAL:"},{"$f":"SUM(L266:L270)","v":0},null,{"$f":"IF('Filtered Information'!$B$1>=A266,\"NO\",\"YES\")","v":"YES"}]
[{"$f":"IFERROR(VLOOKUP(A266,'Filtered Information'!$A$3:$E$66,4,FALSE),\"-\")","v":"-"},"O.T.",null,null,null,null,null,null,null,0,{"$f":"IF(J267>0,K266*1.5,)","v":0},0,"VACATION 8%:",{"$f":"N266*0.08","v":0},null,{"$f":"IF('Filtered Information'!$B$1>=A266,\"NO\",\"YES\")","v":"YES"}]
[{"$f":"IFERROR(VLOOKUP(A266,'Filtered Information'!$A$3:$E$66,3,FALSE),\"-\")","v":"-"},"D.T.",null,null,null,null,null,null,null,0,{"$f":"IF(J268>0,K266*2,)","v":0},0,{"$f":"IF(K266>0,\"TOTAL WAGE:\",0)","v":"TOTAL WAGE:"},{"$f":"N266+N267","v":0},{"$f":"N268","v":0},{"$f":"IF('Filtered Information'!$B$1>=A266,\"NO\",\"YES\")","v":"YES"}]
[{"$f":"IFERROR(VLOOKUP(A266,'Filtered Information'!$A$3:$E$64,5,FALSE),\"-\")","v":"-"},"SHOW",null,null,null,null,null,null,null,0,null,0,null,null,null,{"$f":"IF('Filtered Information'!$B$1>=A266,\"NO\",\"YES\")","v":"YES"}]
[null,"M.P.",null,null,null,null,null,null,null,0,{"$f":"IF(J270>0,K266,)","v":0},0,{"$f":"IF(K266>0,\"UNION 3.5%:\",0)","v":"UNION 3.5%:"},{"$f":"N268*0.035","v":0},null,{"$f":"IF('Filtered Information'!$B$1>=A266,\"NO\",\"YES\")","v":"YES"}]
[{"$f":"A266+1","v":53},"REG.",null,null,null,null,null,null,null,0,{"$f":"IFERROR(VLOOKUP(A271,'Filtered Information'!$A$3:$D$64,2,FALSE),\"0\")","v":"0"},0,{"$f":"IF(K271>0,\"SUBTOTAL:\",0)","v":"SUBTOTAL:"},{"$f":"SUM(L271:L275)","v":0},null,{"$f":"IF('Filtered Information'!$B$1>=A271,\"NO\",\"YES\")","v":"YES"}]
[{"$f":"IFERROR(VLOOKUP(A271,'Filtered Information'!$A$3:$E$66,4,FALSE),\"-\")","v":"-"},"O.T.",null,null,null,null,null,null,null,0,{"$f":"IF(J272>0,K271*1.5,)","v":0},0,"VACATION 8%:",{"$f":"N271*0.08","v":0},null,{"$f":"IF('Filtered Information'!$B$1>=A271,\"NO\",\"YES\")","v":"YES"}]
[{"$f":"IFERROR(VLOOKUP(A271,'Filtered Information'!$A$3:$E$66,3,FALSE),\"-\")","v":"-"},"D.T.",null,null,null,null,null,null,null,0,{"$f":"IF(J273>0,K271*2,)","v":0},0,{"$f":"IF(K271>0,\"TOTAL WAGE:\",0)","v":"TOTAL WAGE:"},{"$f":"N271+N272","v":0},{"$f":"N273","v":0},{"$f":"IF('Filtered Information'!$B$1>=A271,\"NO\",\"YES\")","v":"YES"}]
[{"$f":"IFERROR(VLOOKUP(A271,'Filtered Information'!$A$3:$E$64,5,FALSE),\"-\")","v":"-"},"SHOW",null,null,null,null,null,null,null,0,null,0,null,null,null,{"$f":"IF('Filtered Information'!$B$1>=A271,\"NO\",\"YES\")","v":"YES"}]
[null,"M.P.",null,null,null,null,null,null,null,{"$f":"SUM(C275:I275)","v":0},{"$f":"IF(J275>0,K271,)","v":0},{"$f":"J275*K275","v":0},{"$f":"IF(K271>0,\"UNION 3.5%:\",0)","v":"UNION 3.5%:"},{"$f":"N273*0.035","v":0},null,{"$f":"IF('Filtered Information'!$B$1>=A271,\"NO\",\"YES\")","v":"YES"}]
[{"$f":"A271+1","v":54},"REG.",null,null,null,null,null,null,null,0,{"$f":"IFERROR(VLOOKUP(A276,'Filtered Information'!$A$3:$D$64,2,FALSE),\"0\")","v":"0"},0,{"$f":"IF(K276>0,\"SUBTOTAL:\",0)","v":"SUBTOTAL:"},{"$f":"SUM(L276:L280)","v":0},null,{"$f":"IF('Filtered Information'!$B$1>=A276,\"NO\",\"YES\")","v":"YES"}]
[{"$f":"IFERROR(VLOOKUP(A276,'Filtered Information'!$A$3:$E$66,4,FALSE),\"-\")","v":"-"},"O.T.",null,null,null,null,null,null,null,0,{"$f":"IF(J277>0,K276*1.5,)","v":0},0,"VACATION 8%:",{"$f":"N276*0.08","v":0},null,{"$f":"IF('Filtered Information'!$B$1>=A276,\"NO\",\"YES\")","v":"YES"}]
[{"$f":"IFERROR(VLOOKUP(A276,'Filtered Information'!$A$3:$E$66,3,FALSE),\"-\")","v":"-"},"D.T.",null,null,null,null,null,null,null,0,{"$f":"IF(J278>0,K276*2,)","v":0},0,{"$f":"IF(K276>0,\"TOTAL WAGE:\",0)","v":"TOTAL WAGE:"},{"$f":"N276+N277","v":0},{"$f":"N278","v":0},{"$f":"IF('Filtered Information'!$B$1>=A276,\"NO\",\"YES\")","v":"YES"}]
[{"$f":"IFERROR(VLOOKUP(A276,'Filtered Information'!$A$3:$E$64,5,FALSE),\"-\")","v":"-"},"SHOW",null,null,null,null,null,null,null,0,null,0,null,null,null,{"$f":"IF('Filtered Information'!$B$1>=A276,\"NO\",\"YES\")","v":"YES"}]
[null,"M.P.",null,null,null,null,null,null,null,0,{"$f":"IF(J280>0,K276,)","v":0},0,{"$f":"IF(K276>0,\"UNION 3.5%:\",0)","v":"UNION 3.5%:"},{"$f":"N278*0.035","v":0},null,{"$f":"IF('Filtered Information'!$B$1>=A276,\"NO\",\"YES\")","v":"YES"}]
[{"$f":"A276+1","v":55},"REG.",null,null,null,null,null,null,null,{"$f":"SUM(C281:I281)","v":0},{"$f":"IFERROR(VLOOKUP(A281,'Filtered Information'!$A$3:$D$64,2,FALSE),\"0\")","v":"0"},{"$f":"J281*K281","v":0},{"$f":"IF(K281>0,\"SUBTOTAL:\",0)","v":"SUBTOTAL:"},{"$f":"SUM(L281:L285)","v":0},null,{"$f":"IF('Filtered Information'!$B$1>=A281,\"NO\",\"YES\")","v":"YES"}]
[{"$f":"IFERROR(VLOOKUP(A281,'Filtered Information'!$A$3:$E$66,4,FALSE),\"-\")","v":"-"},"O.T.",null,null,null,null,null,null,null,0,{"$f":"IF(J282>0,K281*1.5,)","v":0},0,"VACATION 8%:",{"$f":"N281*0.08","v":0},null,{"$f":"IF('Filtered Information'!$B$1>=A281,\"NO\",\"YES\")","v":"YES"}]
[{"$f":"IFERROR(VLOOKUP(A281,'Filtered Information'!$A$3:$E$66,3,FALSE),\"-\")","v":"-"},"D.T.",null,null,null,null,null,null,null,0,{"$f":"IF(J283>0,K281*2,)","v":0},0,{"$f":"IF(K281>0,\"TOTAL WAGE:\",0)","v":"TOTAL WAGE:"},{"$f":"N281+N282","v":0},{"$f":"N283","v":0},{"$f":"IF('Filtered Information'!$B$1>=A281,\"NO\",\"YES\")","v":"YES"}]
[{"$f":"IFERROR(VLOOKUP(A281,'Filtered Information'!$A$3:$E$64,5,FALSE),\"-\")","v":"-"},"SHOW",null,null,null,null,null,null,null,0,null,0,null,null,null,{"$f":"IF('Filtered Information'!$B$1>=A281,\"NO\",\"YES\")","v":"YES"}]
[null,"M.P.",null,null,null,null,null,null,null,0,{"$f":"IF(J285>0,K281,)","v":0},0,{"$f":"IF(K281>0,\"UNION 3.5%:\",0)","v":"UNION 3.5%:"},{"$f":"N283*0.035","v":0},null,{"$f":"IF('Filtered Information'!$B$1>=A281,\"NO\",\"YES\")","v":"YES"}]
[{"$f":"A281+1","v":56},"REG.",null,null,null,null,null,null,null,0,{"$f":"IFERROR(VLOOKUP(A286,'Filtered Information'!$A$3:$D$64,2,FALSE),\"0\")","v":"0"},0,{"$f":"IF(K286>0,\"SUBTOTAL:\",0)","v":"SUBTOTAL:"},{"$f":"SUM(L286:L290)","v":0},null,{"$f":"IF('Filtered Information'!$B$1>=A286,\"NO\",\"YES\")","v":"YES"}]
[{"$f":"IFERROR(VLOOKUP(A286,'Filtered Information'!$A$3:$E$66,4,FALSE),\"-\")","v":"-"},"O.T.",null,null,null,null,null,null,null,0,{"$f":"IF(J287>0,K286*1.5,)","v":0},0,"VACATION 8%:",{"$f":"N286*0.08","v":0},null,{"$f":"IF('Filtered Information'!$B$1>=A286,\"NO\",\"YES\")","v":"YES"}]
[{"$f":"IFERROR(VLOOKUP(A286,'Filtered Information'!$A$3:$E$66,3,FALSE),\"-\")","v":"-"},"D.T.",null,null,null,null,null,null,null,0,{"$f":"IF(J288>0,K286*2,)","v":0},0,{"$f":"IF(K286>0,\"TOTAL WAGE:\",0)","v":"TOTAL WAGE:"},{"$f":"N286+N287","v":0},{"$f":"N288","v":0},{"$f":"IF('Filtered Information'!$B$1>=A286,\"NO\",\"YES\")","v":"YES"}]
[{"$f":"IFERROR(VLOOKUP(A286,'Filtered Information'!$A$3:$E$64,5,FALSE),\"-\")","v":"-"},"SHOW",null,null,null,null,null,null,null,0,null,0,null,null,null,{"$f":"IF('Filtered Information'!$B$1>=A286,\"NO\",\"YES\")","v":"YES"}]
[null,"M.P.",null,null,null,null,null,null,null,0,{"$f":"IF(J290>0,K286,)","v":0},0,{"$f":"IF(K286>0,\"UNION 3.5%:\",0)","v":"UNION 3.5%:"},{"$f":"N288*0.035","v":0},null,{"$f":"IF('Filtered Information'!$B$1>=A286,\"NO\",\"YES\")","v":"YES"}]
[{"$f":"A286+1","v":57},"REG.",null,null,null,null,null,null,null,0,{"$f":"IFERROR(VLOOKUP(A291,'Filtered Information'!$A$3:$D$64,2,FALSE),\"0\")","v":"0"},0,{"$f":"IF(K291>0,\"SUBTOTAL:\",0)","v":"SUBTOTAL:"},{"$f":"SUM(L291:L295)","v":0},null,{"$f":"IF('Filtered Information'!$B$1>=A291,\"NO\",\"YES\")","v":"YES"}]
[{"$f":"IFERROR(VLOOKUP(A291,'Filtered Information'!$A$3:$E$66,4,FALSE),\"-\")","v":"-"},"O.T.",null,null,null,null,null,null,null,0,{"$f":"IF(J292>0,K291*1.5,)","v":0},0,"VACATION 8%:",{"$f":"N291*0.08","v":0},null,{"$f":"IF('Filtered Information'!$B$1>=A291,\"NO\",\"YES\")","v":"YES"}]
[{"$f":"IFERROR(VLOOKUP(A291,'Filtered Information'!$A$3:$E$66,3,FALSE),\"-\")","v":"-"},"D.T.",null,null,null,null,null,null,null,0,{"$f":"IF(J293>0,K291*2,)","v":0},0,{"$f":"IF(K291>0,\"TOTAL WAGE:\",0)","v":"TOTAL WAGE:"},{"$f":"N291+N292","v":0},{"$f":"N293","v":0},{"$f":"IF('Filtered Information'!$B$1>=A291,\"NO\",\"YES\")","v":"YES"}]
[{"$f":"IFERROR(VLOOKUP(A291,'Filtered Information'!$A$3:$E$64,5,FALSE),\"-\")","v":"-"},"SHOW",null,null,null,null,null,null,null,0,null,0,null,null,null,{"$f":"IF('Filtered Information'!$B$1>=A291,\"NO\",\"YES\")","v":"YES"}]
[null,"M.P.",null,null,null,null,null,null,null,0,{"$f":"IF(J295>0,K291,)","v":0},0,{"$f":"IF(K291>0,\"UNION 3.5%:\",0)","v":"UNION 3.5%:"},{"$f":"N293*0.035","v":0},null,{"$f":"IF('Filtered Information'!$B$1>=A291,\"NO\",\"YES\")","v":"YES"}]
[{"$f":"A291+1","v":58},"REG.",null,null,null,null,null,null,null,0,{"$f":"IFERROR(VLOOKUP(A296,'Filtered Information'!$A$3:$D$64,2,FALSE),\"0\")","v":"0"},0,{"$f":"IF(K296>0,\"SUBTOTAL:\",0)","v":"SUBTOTAL:"},{"$f":"SUM(L296:L300)","v":0},null,{"$f":"IF('Filtered Information'!$B$1>=A296,\"NO\",\"YES\")","v":"YES"}]
[{"$f":"IFERROR(VLOOKUP(A296,'Filtered Information'!$A$3:$E$66,4,FALSE),\"-\")","v":"-"},"O.T.",null,null,null,null,null,null,null,0,{"$f":"IF(J297>0,K296*1.5,)","v":0},0,"VACATION 8%:",{"$f":"N296*0.08","v":0},null,{"$f":"IF('Filtered Information'!$B$1>=A296,\"NO\",\"YES\")","v":"YES"}]
[{"$f":"IFERROR(VLOOKUP(A296,'Filtered Information'!$A$3:$E$66,3,FALSE),\"-\")","v":"-"},"D.T.",null,null,null,null,null,null,null,0,{"$f":"IF(J298>0,K296*2,)","v":0},0,{"$f":"IF(K296>0,\"TOTAL WAGE:\",0)","v":"TOTAL WAGE:"},{"$f":"N296+N297","v":0},{"$f":"N298","v":0},{"$f":"IF('Filtered Information'!$B$1>=A296,\"NO\",\"YES\")","v":"YES"}]
[{"$f":"IFERROR(VLOOKUP(A296,'Filtered Information'!$A$3:$E$64,5,FALSE),\"-\")","v":"-"},"SHOW",null,null,null,null,null,null,null,0,null,0,null,null,null,{"$f":"IF('Filtered Information'!$B$1>=A296,\"NO\",\"YES\")","v":"YES"}]
[null,"M.P.",null,null,null,null,null,null,null,0,{"$f":"IF(J300>0,K296,)","v":0},0,{"$f":"IF(K296>0,\"UNION 3.5%:\",0)","v":"UNION 3.5%:"},{"$f":"N298*0.035","v":0},null,{"$f":"IF('Filtered Information'!$B$1>=A296,\"NO\",\"YES\")","v":"YES"}]
[{"$f":"A296+1","v":59},"REG.",null,null,null,null,null,null,null,{"$f":"SUM(C301:I301)","v":0},{"$f":"IFERROR(VLOOKUP(A301,'Filtered Information'!$A$3:$D$64,2,FALSE),\"0\")","v":"0"},{"$f":"J301*K301","v":0},{"$f":"IF(K301>0,\"SUBTOTAL:\",0)","v":"SUBTOTAL:"},{"$f":"SUM(L301:L305)","v":0},null,{"$f":"IF('Filtered Information'!$B$1>=A301,\"NO\",\"YES\")","v":"YES"}]
[{"$f":"IFERROR(VLOOKUP(A301,'Filtered Information'!$A$3:$E$66,4,FALSE),\"-\")","v":"-"},"O.T.",null,null,null,null,null,null,null,0,{"$f":"IF(J302>0,K301*1.5,)","v":0},0,"VACATION 8%:",{"$f":"N301*0.08","v":0},null,{"$f":"IF('Filtered Information'!$B$1>=A301,\"NO\",\"YES\")","v":"YES"}]
[{"$f":"IFERROR(VLOOKUP(A301,'Filtered Information'!$A$3:$E$66,3,FALSE),\"-\")","v":"-"},"D.T.",null,null,null,null,null,null,null,0,{"$f":"IF(J303>0,K301*2,)","v":0},0,{"$f":"IF(K301>0,\"TOTAL WAGE:\",0)","v":"TOTAL WAGE:"},{"$f":"N301+N302","v":0},{"$f":"N303","v":0},{"$f":"IF('Filtered Information'!$B$1>=A301,\"NO\",\"YES\")","v":"YES"}]
[{"$f":"IFERROR(VLOOKUP(A301,'Filtered Information'!$A$3:$E$64,5,FALSE),\"-\")","v":"-"},"SHOW",null,null,null,null,null,null,null,0,null,0,null,null,null,{"$f":"IF('Filtered Information'!$B$1>=A301,\"NO\",\"YES\")","v":"YES"}]
[null,"M.P.",null,null,null,null,null,null,null,0,{"$f":"IF(J305>0,K301,)","v":0},0,{"$f":"IF(K301>0,\"UNION 3.5%:\",0)","v":"UNION 3.5%:"},{"$f":"N303*0.035","v":0},null,{"$f":"IF('Filtered Information'!$B$1>=A301,\"NO\",\"YES\")","v":"YES"}]
[{"$f":"A301+1","v":60},"REG.",null,null,null,null,null,null,null,0,{"$f":"IFERROR(VLOOKUP(A306,'Filtered Information'!$A$3:$D$64,2,FALSE),\"0\")","v":"0"},0,{"$f":"IF(K306>0,\"SUBTOTAL:\",0)","v":"SUBTOTAL:"},{"$f":"SUM(L306:L310)","v":0},null,{"$f":"IF('Filtered Information'!$B$1>=A306,\"NO\",\"YES\")","v":"YES"}]
[{"$f":"IFERROR(VLOOKUP(A306,'Filtered Information'!$A$3:$E$66,4,FALSE),\"-\")","v":"-"},"O.T.",null,null,null,null,null,null,null,0,{"$f":"IF(J307>0,K306*1.5,)","v":0},0,"VACATION 8%:",{"$f":"N306*0.08","v":0},null,{"$f":"IF('Filtered Information'!$B$1>=A306,\"NO\",\"YES\")","v":"YES"}]
[{"$f":"IFERROR(VLOOKUP(A306,'Filtered Information'!$A$3:$E$66,3,FALSE),\"-\")","v":"-"},"D.T.",null,null,null,null,null,null,null,0,{"$f":"IF(J308>0,K306*2,)","v":0},0,{"$f":"IF(K306>0,\"TOTAL WAGE:\",0)","v":"TOTAL WAGE:"},{"$f":"N306+N307","v":0},{"$f":"N308","v":0},{"$f":"IF('Filtered Information'!$B$1>=A306,\"NO\",\"YES\")","v":"YES"}]
[{"$f":"IFERROR(VLOOKUP(A306,'Filtered Information'!$A$3:$E$64,5,FALSE),\"-\")","v":"-"},"SHOW",null,null,null,null,null,null,null,0,null,0,null,null,null,{"$f":"IF('Filtered Information'!$B$1>=A306,\"NO\",\"YES\")","v":"YES"}]
[null,"M.P.",null,null,null,null,null,null,null,0,{"$f":"IF(J310>0,K306,)","v":0},0,{"$f":"IF(K306>0,\"UNION 3.5%:\",0)","v":"UNION 3.5%:"},{"$f":"N308*0.035","v":0},null,{"$f":"IF('Filtered Information'!$B$1>=A306,\"NO\",\"YES\")","v":"YES"}]
[{"$f":"A306+1","v":61},"REG.",null,null,null,null,null,null,null,0,{"$f":"IFERROR(VLOOKUP(A311,'Filtered Information'!$A$3:$D$64,2,FALSE),\"0\")","v":"0"},0,{"$f":"IF(K311>0,\"SUBTOTAL:\",0)","v":"SUBTOTAL:"},{"$f":"SUM(L311:L315)","v":0},null,{"$f":"IF('Filtered Information'!$B$1>=A311,\"NO\",\"YES\")","v":"YES"}]
[{"$f":"IFERROR(VLOOKUP(A311,'Filtered Information'!$A$3:$E$66,4,FALSE),\"-\")","v":"-"},"O.T.",null,null,null,null,null,null,null,0,{"$f":"IF(J312>0,K311*1.5,)","v":0},0,"VACATION 8%:",{"$f":"N311*0.08","v":0},null,{"$f":"IF('Filtered Information'!$B$1>=A311,\"NO\",\"YES\")","v":"YES"}]
[{"$f":"IFERROR(VLOOKUP(A311,'Filtered Information'!$A$3:$E$66,3,FALSE),\"-\")","v":"-"},"D.T.",null,null,null,null,null,null,null,0,{"$f":"IF(J313>0,K311*2,)","v":0},0,{"$f":"IF(K311>0,\"TOTAL WAGE:\",0)","v":"TOTAL WAGE:"},{"$f":"N311+N312","v":0},{"$f":"N313","v":0},{"$f":"IF('Filtered Information'!$B$1>=A311,\"NO\",\"YES\")","v":"YES"}]
[{"$f":"IFERROR(VLOOKUP(A311,'Filtered Information'!$A$3:$E$64,5,FALSE),\"-\")","v":"-"},"SHOW",null,null,null,null,null,null,null,0,null,0,null,null,null,{"$f":"IF('Filtered Information'!$B$1>=A311,\"NO\",\"YES\")","v":"YES"}]
[null,"M.P.",null,null,null,null,null,null,null,0,{"$f":"IF(J315>0,K311,)","v":0},0,{"$f":"IF(K311>0,\"UNION 3.5%:\",0)","v":"UNION 3.5%:"},{"$f":"N313*0.035","v":0},null,{"$f":"IF('Filtered Information'!$B$1>=A311,\"NO\",\"YES\")","v":"YES"}]
[{"$f":"A311+1","v":62},"REG.",null,null,null,null,null,null,null,0,{"$f":"IFERROR(VLOOKUP(A316,'Filtered Information'!$A$3:$D$64,2,FALSE),\"0\")","v":"0"},0,{"$f":"IF(K316>0,\"SUBTOTAL:\",0)","v":"SUBTOTAL:"},{"$f":"SUM(L316:L320)","v":0},null,{"$f":"IF('Filtered Information'!$B$1>=A316,\"NO\",\"YES\")","v":"YES"}]
[{"$f":"IFERROR(VLOOKUP(A316,'Filtered Information'!$A$3:$E$66,4,FALSE),\"-\")","v":"-"},"O.T.",null,null,null,null,null,null,null,0,{"$f":"IF(J317>0,K316*1.5,)","v":0},0,"VACATION 8%:",{"$f":"N316*0.08","v":0},null,{"$f":"IF('Filtered Information'!$B$1>=A316,\"NO\",\"YES\")","v":"YES"}]
[{"$f":"IFERROR(VLOOKUP(A316,'Filtered Information'!$A$3:$E$66,3,FALSE),\"-\")","v":"-"},"D.T.",null,null,null,null,null,null,null,0,{"$f":"IF(J318>0,K316*2,)","v":0},0,{"$f":"IF(K316>0,\"TOTAL WAGE:\",0)","v":"TOTAL WAGE:"},{"$f":"N316+N317","v":0},{"$f":"N318","v":0},{"$f":"IF('Filtered Information'!$B$1>=A316,\"NO\",\"YES\")","v":"YES"}]
[{"$f":"IFERROR(VLOOKUP(A316,'Filtered Information'!$A$3:$E$64,5,FALSE),\"-\")","v":"-"},"SHOW",null,null,null,null,null,null,null,0,null,0,null,null,null,{"$f":"IF('Filtered Information'!$B$1>=A316,\"NO\",\"YES\")","v":"YES"}]
[null,"M.P.",null,null,null,null,null,null,null,0,{"$f":"IF(J320>0,K316,)","v":0},0,{"$f":"IF(K316>0,\"UNION 3.5%:\",0)","v":"UNION 3.5%:"},{"$f":"N318*0.035","v":0},null,{"$f":"IF('Filtered Information'!$B$1>=A316,\"NO\",\"YES\")","v":"YES"}]
[{"$f":"A316+1","v":63},"REG.",null,null,null,null,null,null,null,0,{"$f":"IFERROR(VLOOKUP(A321,'Filtered Information'!$A$3:$D$66,2,FALSE),\"0\")","v":"0"},0,{"$f":"IF(K321>0,\"SUBTOTAL:\",0)","v":"SUBTOTAL:"},{"$f":"SUM(L321:L325)","v":0},null,{"$f":"IF('Filtered Information'!$B$1>=A321,\"NO\",\"YES\")","v":"YES"}]
[{"$f":"IFERROR(VLOOKUP(A321,'Filtered Information'!$A$3:$E$66,4,FALSE),\"-\")","v":"-"},"O.T.",null,null,null,null,null,null,null,0,{"$f":"IF(J322>0,K321*1.5,)","v":0},0,"VACATION 8%:",{"$f":"N321*0.08","v":0},null,{"$f":"IF('Filtered Information'!$B$1>=A321,\"NO\",\"YES\")","v":"YES"}]
[{"$f":"IFERROR(VLOOKUP(A321,'Filtered Information'!$A$3:$E$66,3,FALSE),\"-\")","v":"-"},"D.T.",null,null,null,null,null,null,null,0,{"$f":"IF(J323>0,K321*2,)","v":0},0,{"$f":"IF(K321>0,\"TOTAL WAGE:\",0)","v":"TOTAL WAGE:"},{"$f":"N321+N322","v":0},{"$f":"N323","v":0},{"$f":"IF('Filtered Information'!$B$1>=A321,\"NO\",\"YES\")","v":"YES"}]
[{"$f":"IFERROR(VLOOKUP(A321,'Filtered Information'!$A$3:$E$64,5,FALSE),\"-\")","v":"-"},"SHOW",null,null,null,null,null,null,null,0,null,0,null,null,null,{"$f":"IF('Filtered Information'!$B$1>=A321,\"NO\",\"YES\")","v":"YES"}]
[null,"M.P.",null,null,null,null,null,null,null,0,{"$f":"IF(J325>0,K321,)","v":0},0,{"$f":"IF(K321>0,\"UNION 3.5%:\",0)","v":"UNION 3.5%:"},{"$f":"N323*0.035","v":0},null,{"$f":"IF('Filtered Information'!$B$1>=A321,\"NO\",\"YES\")","v":"YES"}]
[{"$f":"A321+1","v":64},"REG.",null,null,null,null,null,null,null,0,{"$f":"IFERROR(VLOOKUP(A326,'Filtered Information'!$A$3:$D$66,2,FALSE),\"0\")","v":"0"},0,{"$f":"IF(K326>0,\"SUBTOTAL:\",0)","v":"SUBTOTAL:"},{"$f":"SUM(L326:L330)","v":0},null,{"$f":"IF('Filtered Information'!$B$1>=A326,\"NO\",\"YES\")","v":"YES"}]
[{"$f":"IFERROR(VLOOKUP(A326,'Filtered Information'!$A$3:$E$66,4,FALSE),\"-\")","v":"-"},"O.T.",null,null,null,null,null,null,null,0,{"$f":"IF(J327>0,K326*1.5,)","v":0},0,"VACATION 8%:",{"$f":"N326*0.08","v":0},null,{"$f":"IF('Filtered Information'!$B$1>=A326,\"NO\",\"YES\")","v":"YES"}]
[{"$f":"IFERROR(VLOOKUP(A326,'Filtered Information'!$A$3:$E$66,3,FALSE),\"-\")","v":"-"},"D.T.",null,null,null,null,null,null,null,0,{"$f":"IF(J328>0,K326*2,)","v":0},0,{"$f":"IF(K326>0,\"TOTAL WAGE:\",0)","v":"TOTAL WAGE:"},{"$f":"N326+N327","v":0},{"$f":"N328","v":0},{"$f":"IF('Filtered Information'!$B$1>=A326,\"NO\",\"YES\")","v":"YES"}]
[{"$f":"IFERROR(VLOOKUP(A326,'Filtered Information'!$A$3:$E$64,5,FALSE),\"-\")","v":"-"},"SHOW",null,null,null,null,null,null,null,0,null,0,null,null,null,{"$f":"IF('Filtered Information'!$B$1>=A326,\"NO\",\"YES\")","v":"YES"}]
[null,"M.P.",null,null,null,null,null,null,null,0,{"$f":"IF(J330>0,K326,)","v":0},0,{"$f":"IF(K326>0,\"UNION 3.5%:\",0)","v":"UNION 3.5%:"},{"$f":"N328*0.035","v":0},null,{"$f":"IF('Filtered Information'!$B$1>=A326,\"NO\",\"YES\")","v":"YES"}]
["IN ADDITION TO THE ABOVE WAGES, PAY THE FOLLOWING BY SEPARATE CHECKS:",null,null,null,null,null,null,null,null,null,null,null,null,null,null,null,null,null,null,null,null,null,null,null,null,null,null,null,null,null,null,null,null,null,null,null,null,"Select Report","#","H&W","Pension","Work Fee","Training"]
[{"$f":"CONCATENATE(\"Local #16  I.A.T.S.E.  Health & Welfare Fund \",VLOOKUP($AL$332,$AM$332:$AQ$336,2,FALSE)*100,\"% of gross wages.............................\")","v":"Local #16  I.A.T.S.E.  Health & Welfare Fund 14% of gross wages............................."},null,null,null,null,null,null,null,null,null,null,{"$f":"SUM(O:O)","v":0},"=",{"$f":"L332*VLOOKUP($AL$332,$AM$332:$AQ$336,2,FALSE)","v":0},null,null,null,null,null,null,null,null,null,null,null,null,null,null,null,null,null,null,null,null,null,null,null,"A","A",0.14000000000000001,7.6999999999999999E-2,3.5000000000000003E-2,5.0000000000000001E-3]
[{"$f":"CONCATENATE(\"Local #16  I.A.T.S.E.  Pension Fund \",VLOOKUP($AL$332,$AM$332:$AQ$336,3,FALSE)*100,\"% surchage of gross wages..............................................\")","v":"Local #16  I.A.T.S.E.  Pension Fund 7.7% surchage of gross wages.............................................."},null,null,null,null,null,null,null,null,null,null,{"$f":"L332","v":0},"=",{"$f":"L333*VLOOKUP($AL$332,$AM$332:$AQ$336,3,FALSE)","v":0},null,null,null,null,null,null,null,null,null,null,null,null,null,null,null,null,null,null,null,null,null,null,null,null,"B",0.14000000000000001,9.5000000000000001E-2,3.5000000000000003E-2,5.0000000000000001E-3]
[{"$f":"CONCATENATE(\"Local #16  I.A.T.S.E.  Work Fee \",VLOOKUP($AL$332,$AM$332:$AQ$336,4,FALSE)*100,\"% of gross wages..............................................\")","v":"Local #16  I.A.T.S.E.  Work Fee 3.5% of gross wages.............................................."},null,null,null,null,null,null,null,null,null,null,{"$f":"L332","v":0},"=",{"$f":"L334*VLOOKUP($AL$332,$AM$332:$AQ$336,4,FALSE)","v":0},null,null,null,null,null,null,null,null,null,null,null,null,null,null,null,null,null,null,null,null,null,null,null,null,"C",0.14000000000000001,9.5000000000000001E-2,3.5000000000000003E-2,5.0000000000000001E-3]
[{"$f":"CONCATENATE(\"Local #16  I.A.T.S.E.  Training Fee \",VLOOKUP($AL$332,$AM$332:$AQ$336,5,FALSE)*100,\"% of gross wages..............................................\")","v":"Local #16  I.A.T.S.E.  Training Fee 0.5% of gross wages.............................................."},null,null,null,null,null,null,null,null,null,null,{"$f":"L332","v":0},"=",{"$f":"L335*VLOOKUP($AL$332,$AM$332:$AQ$336,5,FALSE)","v":0},null,null,null,null,null,null,null,null,null,null,null,null,null,null,null,null,null,null,null,null,null,null,null,null,"D",0.14000000000000001,0.105,3.5000000000000003E-2,5.0000000000000001E-3]
["MAIL ALL CHECKS TO ABOVE ADDRESS CARE OF STEVE LUTGE, Secretary",null,null,null,null,null,null,null,null,null,null,null,null,null,null,null,null,null,null,null,null,null,null,null,null,null,null,null,null,null,null,null,null,null,null,null,null,null,"E",0.15,0.14000000000000001,3.5000000000000003E-2,0.02]