{"text_format":"1","workbook":"xlsx","n_sheets":4,"sheets":["PDF Information","Wage and Name","Filtered Information","Payroll Sheet"],"not_rendered":{"charts":0,"images":3,"macros":1,"external_links":0,"defined_names":8,"comments":1,"pivot_tables":0},"unopened":[],"bounds":{"document_bytes":16777216,"sheet_cells":100000,"rows_first":2000,"rows_last":500,"rows_between":2000,"halvings":0,"cell_chars":16384,"cell_head_chars":4096},"cells_cut":0,"cells_raw":0,"read":"whole","date_system":"1900"}

{"sheet":"PDF Information","index":0,"n_rows":700,"n_cols":22,"rows_kept":700,"cut":false,"hidden":false,"merged":[[0,1,0,11],[1,1,1,11]]}
["Path to PDF File","D:\\D.Dropbox\\Dropbox\\Work\\0342.pdf"]
["Path to Shell Command","C:\\Program Files (x86)\\Adobe\\Reader 11.0\\Reader\\AcroRd32.exe"]
[]
[null,null,null,null,"Job_ID",{"$f":"IFERROR(INDEX((RIGHT($A$4:$A$560,LEN(INDEX($A$4:$A$560,MATCH(E4&\"*\",$A$4:$A$560,)))-LEN(E4)-1)),MATCH(E4&\"*\",$A$4:$A$560,)),\"\")","v":""},null,null,null,null,null,null,null,null,null,null,null,null,null,null,null,"Date Reference"]
[null,null,null,null,"Employer",{"$f":"IFERROR(INDEX((RIGHT($A$4:$A$560,LEN(INDEX($A$4:$A$560,MATCH(E5&\"*\",$A$4:$A$560,)))-LEN(E5)-1)),MATCH(E5&\"*\",$A$4:$A$560,)),\"\")","v":""},null,null,null,null,null,null,null,null,null,null,null,null,null,null,null,{"$f":"CONCATENATE(A5,\" \",B5,\" \",C5,\" \",D5)","v":"   "}]
[null,null,null,null,"Pay roll",{"$f":"IFERROR(INDEX((RIGHT($A$4:$A$560,LEN(INDEX($A$4:$A$560,MATCH(E6&\"*\",$A$4:$A$560,)))-LEN(E6)-1)),MATCH(E6&\"*\",$A$4:$A$560,)),\"\")","v":""},null,null,null,null,null,null,null,null,null,null,null,null,null,null,null,{"$f":"CONCATENATE(A6,\" \",B6,\" \",C6,\" \",D6)","v":"   "}]
[null,null,null,null,"RT Person",{"$f":"IFERROR(INDEX((RIGHT($A$4:$A$560,LEN(INDEX($A$4:$A$560,MATCH(E7&\"*\",$A$4:$A$560,)))-LEN(E7)-1)),MATCH(E7&\"*\",$A$4:$A$560,)),\"\")","v":""},null,null,null,null,null,null,null,null,null,null,null,null,null,null,null,"   "]
[null,null,null,null,"RT Location",{"$f":"IFERROR(INDEX((RIGHT($A$4:$A$560,LEN(INDEX($A$4:$A$560,MATCH(E8&\"*\",$A$4:$A$560,)))-LEN(E8)-1)),MATCH(E8&\"*\",$A$4:$A$560,)),\"\")","v":""},null," ",null,null,null,null,null,null,null,null,null,null,null,null,null,"   "]
[null,null,null,null,"Date"," Tuesday  October 28, 2013 ",null,null,null,null,null,null,null,null,null,null,null,null,null,null,null,"   "]
[null,null,null,null,"Pension",{"$f":"IFERROR(INDEX((RIGHT($A$4:$A$560,LEN(INDEX($A$4:$A$560,MATCH(E10&\"*\",$A$4:$A$560,)))-LEN(E10)-1)),MATCH(E10&\"*\",$A$4:$A$560,)),\"\")","v":""},null,null,null,null,null,null,null,null,null,null,null,null,null,null,null,"   "]
[null,null,null,null,"Health&Welfare",{"$f":"IFERROR(INDEX((RIGHT($A$4:$A$560,LEN(INDEX($A$4:$A$560,MATCH(E11&\"*\",$A$4:$A$560,)))-LEN(E11)-1)),MATCH(E11&\"*\",$A$4:$A$560,)),\"\")","v":""},null,null,null,null,null,null,null,null,null,null,null,null,null,null,null,"   "]
[null,null,null,null,"Training Trust",{"$f":"IFERROR(INDEX((RIGHT($A$4:$A$560,LEN(INDEX($A$4:$A$560,MATCH(E12&\"*\",$A$4:$A$560,)))-LEN(E12)-1)),MATCH(E12&\"*\",$A$4:$A$560,)),\"\")","v":""},null,null,null,null,null,null,null,null,null,null,null,null,null,null,null,"   "]
[null,null,null,null,null,null,null,null,null,null,null,null,null,null,"#",null,null,null,null,"Position",null,"   "]
[null,null,null,null,"$",{"$f":"IFERROR(INDEX(A14,MATCH(E14&\"*\",A14,)),\"-\")","v":"-"},{"$f":"IF(F14=\"-\",\"\",LEFT(F14,6))","v":""},{"$f":"MID(F14,8,50)","v":""},null,{"$f":"IF(F14=\"-\",\"-\",LEFT(F14,6))","v":"-"},{"$f":"I14","v":0},{"$f":"IF(F14=\"-\",\"\",B14)","v":""},null,null,1,{"$f":"IFERROR(INDEX((LEFT($A$4:$A$700,LEN(INDEX($A$4:$A$700,MATCH(O14&\"*\",$A$4:$A$700,)))-LEN(O14)-1)),MATCH(O14&\" *\",$A$4:$A$700,)),\"\")","v":""},{"$f":"IFERROR(RIGHT(P14,(LEN(P14)-(LEN(O14)+1))),\"\")","v":""},{"$f":"IFERROR(IF(Q14=\"\",\"\",FIND(\" AM \",Q14)),0)","v":""},{"$f":"IFERROR(IF(Q14=\"\",\"\",FIND(\" PM \",Q14)),0)","v":""},{"$f":"IFERROR(IF(AND(R14=0,S14=0),Q14,IF(R14>0,LEFT(Q14,R14-6),LEFT(Q14,S14-6))),\"\")","v":""},null,"   "]
[null,null,null,null,"$","-",{"$f":"IF(F15=\"-\",\"\",LEFT(F15,6))","v":""},"",null,"-",0,"",null,null,2,{"$f":"IFERROR(INDEX((LEFT($A$4:$A$700,LEN(INDEX($A$4:$A$700,MATCH(O15&\"*\",$A$4:$A$700,)))-LEN(O15)-1)),MATCH(O15&\" *\",$A$4:$A$700,)),\"\")","v":""},{"$f":"IFERROR(RIGHT(P15,(LEN(P15)-(LEN(O15)+1))),\"\")","v":""},{"$f":"IFERROR(IF(Q15=\"\",\"\",FIND(\" AM \",Q15)),0)","v":""},{"$f":"IFERROR(IF(Q15=\"\",\"\",FIND(\" PM \",Q15)),0)","v":""},{"$f":"IFERROR(IF(AND(R15=0,S15=0),Q15,IF(R15>0,LEFT(Q15,R15-6),LEFT(Q15,S15-6))),\"\")","v":""},null,"   "]
[null,null,null,null,"$","-","","",null,"-",0,"",null,null,3,"","","","","",null,"   "]
[null,null,null,null,"$","-","","",null,"-",0,"",null,null,4,"","","","","",null,"   "]
[null,null,null,null,"$","-","","",null,"-",0,"",null,null,5,"","","","","",null,"   "]
[null,null,null,null,"$","-","","",null,"-",0,"",null,null,6,"","","","","",null,"   "]
[null,null,null,null,"$","-","","",null,"-",0,"",null,null,7,"","","","","",null,"   "]
[null,null,null,null,"$","-","","",null,"-",0,"",null,null,8,"","","","","",null,"   "]
[null,null,null,null,"$","-","","",null,"-",0,"",null,null,9,"","","","","",null,"   "]
[null,null,null,null,"$","-","","",null,"-",0,"",null,null,10,"","","","","",null,"   "]
[null,null,null,null,"$","-","","",null,"-",0,"",null,null,11,"","","","","",null,"   "]
[null,null,null,null,"$","-","","",null,"-",0,"",null,null,12,"","","","","",null,"   "]
[null,null,null,null,"$","-","","",null,"-",0,"",null,null,13,"","","","","",null,"   "]
[null,null,null,null,"$","-","","",null,"-",0,"",null,null,14,"","","","","",null,"   "]
[null,null,null,null,"$","-","","",null,"-",0,"",null,null,15,"","","","","",null,"   "]
[null,null,null,null,"$","-","",{"$f":"MID(F29,8,50)","v":""},null,"-",0,"",null,null,16,"","","","","",null,"   "]
[null,null,null,null,"$","-","",{"$f":"MID(F30,8,50)","v":""},null,"-",0,"",null,null,17,"","","","","",null,"   "]
{"$rows_left_out":671}
{"sheet":"Wage and Name","index":1,"n_rows":1,"n_cols":3,"rows_kept":1,"cut":false,"hidden":false,"merged":[]}
["#","Wage","First Name"]

{"sheet":"Filtered Information","index":2,"n_rows":82,"n_cols":23,"rows_kept":82,"cut":false,"hidden":false,"merged":[]}
["Number of slots required",{"$f":"MAX(A3:A66)","v":0},"Date value",{"$f":"DATEVALUE(O1)","v":"2013-10-28"},null,null,null,null,null,null,null,null,null,null,{"$f":"CONCATENATE(T1,\"/\",P1,\"/\",W1)","v":"28/10/2013"},{"$f":"SUM(P3:P14)","v":10},null,null,null,{"$f":"SUM(T3:T82)","v":28},null,null,{"$f":"SUM(W3:W9)","v":2013}]
["#","Wage","First Name","Last Name","Position",null,null,null,null,null,null,null,null,null,"Month","Month #","Day","YES/NO",null,"Date","Year","YES/NO","Year"]
[{"$f":"IF(ISBLANK(B3),\"-\",1)","v":"-"},null,null,null,null,null,null,null,null,null,null,null,null,null,"January",{"$f":"IFERROR(IF(FIND(O3,'PDF Information'!$F$9)>0,1,\"\"),\"\")","v":""},1,{"$f":"IFERROR(IF(FIND(\" 1 \",'PDF Information'!$F$9)>0,1,\"\"),\"\")","v":""},null,{"$f":"IF(R3=\"\",\"\",Q3*R3)","v":""},2013,{"$f":"IFERROR(IF(FIND(U3,'PDF Information'!$F$9)>0,1,\"\"),\"\")","v":1},{"$f":"IF(V3=\"\",\"\",V3*U3)","v":2013}]
[{"$f":"IF(ISBLANK(B4),\"\",A3+1)","v":""},null,null,null,null,null,null,null,null,null,null,null,null,null,"February",{"$f":"IFERROR(IF(FIND(O4,'PDF Information'!$F$9)>0,2,\"\"),\"\")","v":""},2,{"$f":"IFERROR(IF(FIND(\" 2 \",'PDF Information'!$F$9)>0,1,\"\"),\"\")","v":""},null,"",2014,{"$f":"IFERROR(IF(FIND(U4,'PDF Information'!$F$9)>0,1,\"\"),\"\")","v":""},{"$f":"IF(V4=\"\",\"\",V4*U4)","v":""}]
[{"$f":"IF(ISBLANK(B5),\"\",A4+1)","v":""},null,null,null,null,null,null,null,null,null,null,null,null,null,"March",{"$f":"IFERROR(IF(FIND(O5,'PDF Information'!$F$9)>0,3,\"\"),\"\")","v":""},3,{"$f":"IFERROR(IF(FIND(\" 3 \",'PDF Information'!$F$9)>0,1,\"\"),\"\")","v":""},null,"",2015,{"$f":"IFERROR(IF(FIND(U5,'PDF Information'!$F$9)>0,1,\"\"),\"\")","v":""},{"$f":"IF(V5=\"\",\"\",V5*U5)","v":""}]
["",null,null,null,null,null,null,null,null,null,null,null,null,null,"April",{"$f":"IFERROR(IF(FIND(O6,'PDF Information'!$F$9)>0,4,\"\"),\"\")","v":""},4,{"$f":"IFERROR(IF(FIND(\" 4 \",'PDF Information'!$F$9)>0,1,\"\"),\"\")","v":""},null,"",2016,{"$f":"IFERROR(IF(FIND(U6,'PDF Information'!$F$9)>0,1,\"\"),\"\")","v":""},""]
["",null,null,null,null,null,null,null,null,null,null,null,null,null,"May",{"$f":"IFERROR(IF(FIND(O7,'PDF Information'!$F$9)>0,5,\"\"),\"\")","v":""},5,{"$f":"IFERROR(IF(FIND(\" 5 \",'PDF Information'!$F$9)>0,1,\"\"),\"\")","v":""},null,"",2017,{"$f":"IFERROR(IF(FIND(U7,'PDF Information'!$F$9)>0,1,\"\"),\"\")","v":""},""]
["",null,null,null,null,null,null,null,null,null,null,null,null,null,"June",{"$f":"IFERROR(IF(FIND(O8,'PDF Information'!$F$9)>0,6,\"\"),\"\")","v":""},6,{"$f":"IFERROR(IF(FIND(\" 6 \",'PDF Information'!$F$9)>0,1,\"\"),\"\")","v":""},null,"",2018,{"$f":"IFERROR(IF(FIND(U8,'PDF Information'!$F$9)>0,1,\"\"),\"\")","v":""},""]
["",null,null,null,null,null,null,null,null,null,null,null,null,null,"July",{"$f":"IFERROR(IF(FIND(O9,'PDF Information'!$F$9)>0,7,\"\"),\"\")","v":""},7,{"$f":"IFERROR(IF(FIND(\" 7 \",'PDF Information'!$F$9)>0,1,\"\"),\"\")","v":""},null,"",2019,{"$f":"IFERROR(IF(FIND(U9,'PDF Information'!$F$9)>0,1,\"\"),\"\")","v":""},""]
["",null,null,null,null,null,null,null,null,null,null,null,null,null,"August",{"$f":"IFERROR(IF(FIND(O10,'PDF Information'!$F$9)>0,8,\"\"),\"\")","v":""},8,{"$f":"IFERROR(IF(FIND(\" 8 \",'PDF Information'!$F$9)>0,1,\"\"),\"\")","v":""},null,"",2020,{"$f":"IFERROR(IF(FIND(U10,'PDF Information'!$F$9)>0,1,\"\"),\"\")","v":""},""]
["",null,null,null,null,null,null,null,null,null,null,null,null,null,"September",{"$f":"IFERROR(IF(FIND(O11,'PDF Information'!$F$9)>0,9,\"\"),\"\")","v":""},9,{"$f":"IFERROR(IF(FIND(\" 9 \",'PDF Information'!$F$9)>0,1,\"\"),\"\")","v":""},null,""]
["",null,null,null,null,null,null,null,null,null,null,null,null,null,"October",{"$f":"IFERROR(IF(FIND(O12,'PDF Information'!$F$9)>0,10,\"\"),\"\")","v":10},10,{"$f":"IFERROR(IF(FIND(\" 10 \",'PDF Information'!$F$9)>0,1,\"\"),\"\")","v":""},null,""]
["",null,null,null,null,null,null,null,null,null,null,null,null,null,"November",{"$f":"IFERROR(IF(FIND(O13,'PDF Information'!$F$9)>0,11,\"\"),\"\")","v":""},11,{"$f":"IFERROR(IF(FIND(\" 11 \",'PDF Information'!$F$9)>0,1,\"\"),\"\")","v":""},null,""]
["",null,null,null,null,null,null,null,null,null,null,null,null,null,"December",{"$f":"IFERROR(IF(FIND(O14,'PDF Information'!$F$9)>0,12,\"\"),\"\")","v":""},12,{"$f":"IFERROR(IF(FIND(\" 12 \",'PDF Information'!$F$9)>0,1,\"\"),\"\")","v":""},null,""]
["",null,null,null,null,null,null,null,null,null,null,null,null,null,null,null,13,{"$f":"IFERROR(IF(FIND(\" 13 \",'PDF Information'!$F$9)>0,1,\"\"),\"\")","v":""},null,""]
["",null,null,null,null,null,null,null,null,null,null,null,null,null,null,null,14,{"$f":"IFERROR(IF(FIND(\" 14 \",'PDF Information'!$F$9)>0,1,\"\"),\"\")","v":""},null,""]
["",null,null,null,null,null,null,null,null,null,null,null,null,null,null,null,15,{"$f":"IFERROR(IF(FIND(\" 15 \",'PDF Information'!$F$9)>0,1,\"\"),\"\")","v":""},null,""]
["",null,null,null,null,null,null,null,null,null,null,null,null,null,null,null,16,{"$f":"IFERROR(IF(FIND(\" 16 \",'PDF Information'!$F$9)>0,1,\"\"),\"\")","v":""},null,""]
["",null,null,null,null,null,null,null,null,null,null,null,null,null,null,null,17,{"$f":"IFERROR(IF(FIND(\" 17 \",'PDF Information'!$F$9)>0,1,\"\"),\"\")","v":""},null,""]
["",null,null,null,null,null,null,null,null,null,null,null,null,null,null,null,18,{"$f":"IFERROR(IF(FIND(\" 18 \",'PDF Information'!$F$9)>0,1,\"\"),\"\")","v":""},null,""]
["",null,null,null,null,null,null,null,null,null,null,null,null,null,null,null,19,{"$f":"IFERROR(IF(FIND(\" 19 \",'PDF Information'!$F$9)>0,1,\"\"),\"\")","v":""},null,""]
["",null,null,null,null,null,null,null,null,null,null,null,null,null,null,null,20,{"$f":"IFERROR(IF(FIND(\" 20 \",'PDF Information'!$F$9)>0,1,\"\"),\"\")","v":""},null,""]
["",null,null,null,null,null,null,null,null,null,null,null,null,null,null,null,21,{"$f":"IFERROR(IF(FIND(\" 21 \",'PDF Information'!$F$9)>0,1,\"\"),\"\")","v":""},null,""]
["",null,null,null,null,null,null,null,null,null,null,null,null,null,null,null,22,{"$f":"IFERROR(IF(FIND(\" 22 \",'PDF Information'!$F$9)>0,1,\"\"),\"\")","v":""},null,""]
["",null,null,null,null,null,null,null,null,null,null,null,null,null,null,null,23,{"$f":"IFERROR(IF(FIND(\" 23 \",'PDF Information'!$F$9)>0,1,\"\"),\"\")","v":""},null,""]
["",null,null,null,null,null,null,null,null,null,null,null,null,null,null,null,24,{"$f":"IFERROR(IF(FIND(\" 24 \",'PDF Information'!$F$9)>0,1,\"\"),\"\")","v":""},null,""]
["",null,null,null,null,null,null,null,null,null,null,null,null,null,null,null,25,{"$f":"IFERROR(IF(FIND(\" 25 \",'PDF Information'!$F$9)>0,1,\"\"),\"\")","v":""},null,""]
["",null,null,null,null,null,null,null,null,null,null,null,null,null,null,null,26,{"$f":"IFERROR(IF(FIND(\" 26 \",'PDF Information'!$F$9)>0,1,\"\"),\"\")","v":""},null,""]
["",null,null,null,null,null,null,null,null,null,null,null,null,null,null,null,27,{"$f":"IFERROR(IF(FIND(\" 27 \",'PDF Information'!$F$9)>0,1,\"\"),\"\")","v":""},null,""]
["",null,null,null,null,null,null,null,null,null,null,null,null,null,null,null,28,{"$f":"IFERROR(IF(FIND(\" 28 \",'PDF Information'!$F$9)>0,1,\"\"),\"\")","v":""},null,""]
{"$rows_left_out":53}
{"sheet":"Payroll Sheet","index":3,"n_rows":336,"n_cols":43,"rows_kept":336,"cut":false,"hidden":false,"merged":[[331,37,335,37],[3,12,3,13],[4,12,4,13],[5,12,5,13]]}
[null,null,null,null,null,null,null,null,null,null,null,null,null,null,null,"Which Row to Hide",null,"rate:","reg","ot","dt","show",null,"reg","ot","dt","sh",null,"reg","ot","dt","sh"]
[null,null,null,null,null,null,null,null,"THEATRICAL STAGE EMPLOYEES LOCAL #16 I.A.T.S.E. PAYROLL SHEET",null,null,null,null,null,null,"NO",null,"head ",33.64,{"$f":"S2*1.5","v":50.46},{"$f":"S2*2","v":67.28},154.24,"foreman",22.95,null,null,null,"Cont Coord",27.3,{"$f":"AC2*1.5","v":40.950000000000003},{"$f":"AC2*2","v":54.6}]
[null,null,null,null,null,null,null,null,"415/441-6400",null,null,null,null,null,null,"NO",null,"extra",30.14,45.21,{"$f":"S3*2","v":60.28},129.43,"shop ex",20.350000000000001,null,null,null,"Asst Coord",25.4,{"$f":"AC3*1.5","v":38.099999999999994},{"$f":"AC3*2","v":50.8}]
[null,null,null,null,null,null,null,null,"240 SECOND ST. ",null,null,"JOB:",{"$f":"'PDF Information'!F4","v":""},null,null,"NO",null,"followspot",{"$f":"S3","v":30.14},45.21,{"$f":"S4*2","v":60.28},140.22,null,null,null,null,null,"Mechanic",23.5,{"$f":"AC4*1.5","v":35.25},{"$f":"AC4*2","v":47}]
[null,null,null,null,null,null,null,null,"SAN FRANCISCO, CA 94105",null,null,"LOCATION:",{"$f":"'PDF Information'!F8","v":""},null,null,"NO",null,"a/v",23.64,35.46,null,null,null,null,null,null,null,"Bench Hand",21.85,{"$f":"AC5*1.5","v":32.775000000000006},{"$f":"AC5*2","v":43.7}]
[0,null,null,null,null,null,null,null,null,null,null,"REPORT TO:",{"$f":"'PDF Information'!F7","v":""},null,null,"NO",null,"a/v stew",33.64,50.46,null,null,"yerba buena hse",24.34,{"$f":"X6*1.5","v":36.51},null,null,"General",19.399999999999999,{"$f":"AC6*1.5","v":29.099999999999998},{"$f":"AC6*2","v":38.799999999999997}]
[null,"COMPANY:",{"$f":"'PDF Information'!F5","v":""},null,null,null,null,null,null,null,null,"START DATE:",{"$f":"'Filtered Information'!D1","v":"2013-10-28"},null,null,"NO",null,"a/v camera",30.14,45.21,null,null,"yerba buena forum",19.739999999999998,{"$f":"X7*1.5","v":29.61}]
[null,"PAYROLL COMPANY:",{"$f":"'PDF Information'!F6","v":""},null,null,null,null,null,null,null,null,"END DATE:",null,null,null,"NO",null,"a/v multi",28.01,42.015000000000001,null,null,"yerba buena extra",17.64,{"$f":"X8*1.5","v":26.46},null,77.180000000000007]
[null,null,{"$f":"C10","v":"2013-10-28"},"-","-","-","-","-","-",null,null,null,null,null,null,"NO",null,"head high",{"$f":"S2+2","v":35.64},53.46,{"$f":"S9*2","v":71.28}]
["NAME:","DATE",{"$f":"M7","v":"2013-10-28"},{"$f":"IF(M8>C10,C10+1,\"-\")","v":"-"},{"$f":"IF(M8>D10,D10+1,\"-\")","v":"-"},{"$f":"IF(M8>E10,E10+1,\"-\")","v":"-"},{"$f":"IF(M8>F10,F10+1,\"-\")","v":"-"},{"$f":"IF(M8>G10,G10+1,\"-\")","v":"-"},{"$f":"IF(M8>H10,H10+1,\"-\")","v":"-"},"NO.","RATE","EXTENSION",null,"TOTALS",null,"NO",null,"extra high",{"$f":"S3+2","v":32.14},48.21,{"$f":"S10*2","v":64.28}]
[{"$f":"A6+1","v":1},"REG.",null,null,null,null,null,null,null,{"$f":"SUM(C11:I11)","v":0},{"$f":"IFERROR(VLOOKUP(A11,'Filtered Information'!$A$3:$D$64,2,FALSE),\"0\")","v":"0"},{"$f":"J11*K11","v":0},{"$f":"IF(K11>0,\"SUBTOTAL:\",0)","v":"SUBTOTAL:"},{"$f":"SUM(L11:L15)","v":0},null,{"$f":"IF('Filtered Information'!$B$1>=A11,\"NO\",\"YES\")","v":"YES"}]
[{"$f":"IFERROR(VLOOKUP(A11,'Filtered Information'!$A$3:$E$66,4,FALSE),\"-\")","v":"-"},"O.T.",null,null,null,null,null,null,null,0,{"$f":"IF(J12>0,K11*1.5,)","v":0},0,"VACATION 8%:",{"$f":"N11*0.08","v":0},null,{"$f":"IF('Filtered Information'!$B$1>=A11,\"NO\",\"YES\")","v":"YES"}]
[{"$f":"IFERROR(VLOOKUP(A11,'Filtered Information'!$A$3:$E$66,3,FALSE),\"-\")","v":"-"},"D.T.",null,null,null,null,null,null,null,0,{"$f":"IF(J13>0,K11*2,)","v":0},0,{"$f":"IF(K11>0,\"TOTAL WAGE:\",0)","v":"TOTAL WAGE:"},{"$f":"N11+N12","v":0},{"$f":"N13","v":0},{"$f":"IF('Filtered Information'!$B$1>=A11,\"NO\",\"YES\")","v":"YES"}]
[{"$f":"IFERROR(VLOOKUP(A11,'Filtered Information'!$A$3:$E$64,5,FALSE),\"-\")","v":"-"},"SHOW",null,null,null,null,null,null,null,0,null,0,null,null,null,{"$f":"IF('Filtered Information'!$B$1>=A11,\"NO\",\"YES\")","v":"YES"}]
["LAST 4 SS#","M.P.",null,null,null,null,null,null,null,0,{"$f":"IF(J15>0,K11,)","v":0},0,{"$f":"IF(K11>0,\"UNION 3.5%:\",0)","v":"UNION 3.5%:"},{"$f":"N13*0.035","v":0},null,{"$f":"IF('Filtered Information'!$B$1>=A11,\"NO\",\"YES\")","v":"YES"}]
[{"$f":"A11+1","v":2},"REG.",null,null,null,null,null,null,null,0,{"$f":"IFERROR(VLOOKUP(A16,'Filtered Information'!$A$3:$D$64,2,FALSE),\"0\")","v":"0"},0,{"$f":"IF(K16>0,\"SUBTOTAL:\",0)","v":"SUBTOTAL:"},{"$f":"SUM(L16:L20)","v":0},null,{"$f":"IF('Filtered Information'!$B$1>=A16,\"NO\",\"YES\")","v":"YES"}]
[{"$f":"IFERROR(VLOOKUP(A16,'Filtered Information'!$A$3:$E$66,4,FALSE),\"-\")","v":"-"},"O.T.",null,null,null,null,null,null,null,0,{"$f":"IF(J17>0,K16*1.5,)","v":0},0,"VACATION 8%:",{"$f":"N16*0.08","v":0},null,{"$f":"IF('Filtered Information'!$B$1>=A16,\"NO\",\"YES\")","v":"YES"}]
[{"$f":"IFERROR(VLOOKUP(A16,'Filtered Information'!$A$3:$E$66,3,FALSE),\"-\")","v":"-"},"D.T.",null,null,null,null,null,null,null,0,{"$f":"IF(J18>0,K16*2,)","v":0},0,{"$f":"IF(K16>0,\"TOTAL WAGE:\",0)","v":"TOTAL WAGE:"},{"$f":"N16+N17","v":0},{"$f":"N18","v":0},{"$f":"IF('Filtered Information'!$B$1>=A16,\"NO\",\"YES\")","v":"YES"}]
[{"$f":"IFERROR(VLOOKUP(A16,'Filtered Information'!$A$3:$E$64,5,FALSE),\"-\")","v":"-"},"SHOW",null,null,null,null,null,null,null,0,null,0,null,null,null,{"$f":"IF('Filtered Information'!$B$1>=A16,\"NO\",\"YES\")","v":"YES"}]
[null,"M.P.",null,null,null,null,null,null,null,0,{"$f":"IF(J20>0,K16,)","v":0},0,{"$f":"IF(K16>0,\"UNION 3.5%:\",0)","v":"UNION 3.5%:"},{"$f":"N18*0.035","v":0},null,{"$f":"IF('Filtered Information'!$B$1>=A16,\"NO\",\"YES\")","v":"YES"}]
[{"$f":"A16+1","v":3},"REG.",null,null,null,null,null,null,null,0,{"$f":"IFERROR(VLOOKUP(A21,'Filtered Information'!$A$3:$D$64,2,FALSE),\"0\")","v":"0"},0,{"$f":"IF(K21>0,\"SUBTOTAL:\",0)","v":"SUBTOTAL:"},{"$f":"SUM(L21:L25)","v":0},null,{"$f":"IF('Filtered Information'!$B$1>=A21,\"NO\",\"YES\")","v":"YES"}]
[{"$f":"IFERROR(VLOOKUP(A21,'Filtered Information'!$A$3:$E$66,4,FALSE),\"-\")","v":"-"},"O.T.",null,null,null,null,null,null,null,0,{"$f":"IF(J22>0,K21*1.5,)","v":0},0,"VACATION 8%:",{"$f":"N21*0.08","v":0},null,{"$f":"IF('Filtered Information'!$B$1>=A21,\"NO\",\"YES\")","v":"YES"}]
[{"$f":"IFERROR(VLOOKUP(A21,'Filtered Information'!$A$3:$E$66,3,FALSE),\"-\")","v":"-"},"D.T.",null,null,null,null,null,null,null,0,{"$f":"IF(J23>0,K21*2,)","v":0},0,{"$f":"IF(K21>0,\"TOTAL WAGE:\",0)","v":"TOTAL WAGE:"},{"$f":"N21+N22","v":0},{"$f":"N23","v":0},{"$f":"IF('Filtered Information'!$B$1>=A21,\"NO\",\"YES\")","v":"YES"}]
[{"$f":"IFERROR(VLOOKUP(A21,'Filtered Information'!$A$3:$E$64,5,FALSE),\"-\")","v":"-"},"SHOW",null,null,null,null,null,null,null,0,null,0,null,null,null,{"$f":"IF('Filtered Information'!$B$1>=A21,\"NO\",\"YES\")","v":"YES"}]
[null,"M.P.",null,null,null,null,null,null,null,0,{"$f":"IF(J25>0,K21,)","v":0},0,{"$f":"IF(K21>0,\"UNION 3.5%:\",0)","v":"UNION 3.5%:"},{"$f":"N23*0.035","v":0},null,{"$f":"IF('Filtered Information'!$B$1>=A21,\"NO\",\"YES\")","v":"YES"}]
[{"$f":"A21+1","v":4},"REG.",null,null,null,null,null,null,null,0,{"$f":"IFERROR(VLOOKUP(A26,'Filtered Information'!$A$3:$D$64,2,FALSE),\"0\")","v":"0"},0,{"$f":"IF(K26>0,\"SUBTOTAL:\",0)","v":"SUBTOTAL:"},{"$f":"SUM(L26:L30)","v":0},null,{"$f":"IF('Filtered Information'!$B$1>=A26,\"NO\",\"YES\")","v":"YES"}]
[{"$f":"IFERROR(VLOOKUP(A26,'Filtered Information'!$A$3:$E$66,4,FALSE),\"-\")","v":"-"},"O.T.",null,null,null,null,null,null,null,0,{"$f":"IF(J27>0,K26*1.5,)","v":0},0,"VACATION 8%:",{"$f":"N26*0.08","v":0},null,{"$f":"IF('Filtered Information'!$B$1>=A26,\"NO\",\"YES\")","v":"YES"}]
[{"$f":"IFERROR(VLOOKUP(A26,'Filtered Information'!$A$3:$E$66,3,FALSE),\"-\")","v":"-"},"D.T.",null,null,null,null,null,null,null,0,{"$f":"IF(J28>0,K26*2,)","v":0},0,{"$f":"IF(K26>0,\"TOTAL WAGE:\",0)","v":"TOTAL WAGE:"},{"$f":"N26+N27","v":0},{"$f":"N28","v":0},{"$f":"IF('Filtered Information'!$B$1>=A26,\"NO\",\"YES\")","v":"YES"}]
[{"$f":"IFERROR(VLOOKUP(A26,'Filtered Information'!$A$3:$E$64,5,FALSE),\"-\")","v":"-"},"SHOW",null,null,null,null,null,null,null,0,null,0,null,null,null,{"$f":"IF('Filtered Information'!$B$1>=A26,\"NO\",\"YES\")","v":"YES"}]
[null,"M.P.",null,null,null,null,null,null,null,0,{"$f":"IF(J30>0,K26,)","v":0},0,{"$f":"IF(K26>0,\"UNION 3.5%:\",0)","v":"UNION 3.5%:"},{"$f":"N28*0.035","v":0},null,{"$f":"IF('Filtered Information'!$B$1>=A26,\"NO\",\"YES\")","v":"YES"}]
{"$rows_left_out":306}