Permalink
Commits on Dec 4, 2018
  1. Update Russian translation

    TotalCaesar659 authored and lpereira committed Dec 3, 2018
Commits on Nov 4, 2018
  1. Update Russian translation

    TotalCaesar659 authored and lpereira committed Oct 24, 2018
Commits on Jun 9, 2018
  1. Updated Russian translation

    TotalCaesar659 authored and lpereira committed Jun 9, 2018
Commits on Jun 5, 2018
  1. Fix for the fix

    TotalCaesar659 authored and lpereira committed Jun 5, 2018
Commits on May 27, 2018
  1. Moving configuration files to user's configuration folder

    TotalCaesar659 authored and lpereira committed May 27, 2018
    Build the configuration file path using g_get_user_config_dir() instead of g_get_home_dir().
Commits on Mar 12, 2018
  1. Updated Russian translation

    TotalCaesar659 authored and lpereira committed Feb 28, 2018
Commits on Nov 7, 2017
  1. Updated Russian translation

    TotalCaesar659 authored and lpereira committed Nov 3, 2017
Commits on Oct 9, 2017
Commits on Sep 28, 2017
Commits on Sep 21, 2017
  1. Russian translation update

    TotalCaesar659 authored and lpereira committed Sep 18, 2017
Commits on Sep 10, 2017
Commits on Sep 6, 2017
  1. Fix compilation warning

    TotalCaesar659 authored and lpereira committed Sep 4, 2017
Commits on Sep 3, 2017
  1. Do not use deprecated GtkStock

    TotalCaesar659 authored and lpereira committed Sep 3, 2017
    GtkStock has been deprecated in GTK+ 3.0, so use strings that work
    in both GTK+ 2 and GTK+ 3.
Commits on Sep 2, 2017
  1. Updated Russian translation

    TotalCaesar659 authored and lpereira committed Sep 2, 2017
Commits on Aug 15, 2017
  1. Update Russian translation

    TotalCaesar659 authored and lpereira committed Aug 15, 2017
Commits on Aug 14, 2017
Commits on Aug 7, 2017
  1. Update Russian translation

    TotalCaesar659 authored and lpereira committed Aug 6, 2017
Commits on Jul 30, 2017
  1. Started GTK3 support

    TotalCaesar659 authored and lpereira committed Jul 25, 2017
Commits on Jul 17, 2017
Commits on Jul 15, 2017
  1. Updated Russian translation

    TotalCaesar659 authored and lpereira committed Jul 14, 2017
Commits on Apr 11, 2017
  1. Fixed compile warning in utils.c

    TotalCaesar659 authored and lpereira committed Apr 10, 2017
    Fixed compile warning in utils.c:
    
    [ 37%] Building C object CMakeFiles/hardinfo.dir/hardinfo/util.c.o
    /home/maxpayne/hardinfo/hardinfo/util.c: In function ‘seconds_to_string’:
    /home/maxpayne/hardinfo/hardinfo/util.c:105:34: warning: too many arguments for format [-Wformat-extra-args]
      return g_strdup_printf(ngettext("%d hour, ", "%d hours, ", hours), hours,
                                      ^
    /home/maxpayne/hardinfo/hardinfo/util.c:108:37: warning: too many arguments for format [-Wformat-extra-args]
         return g_strdup_printf(ngettext("%d day, ", "%d days, ", days), days,
                                         ^
    [ 39%] Linking C executable hardinfo
  2. Fixed compile warning in computer.c

    TotalCaesar659 authored and lpereira committed Apr 10, 2017
    Fixed compile warning in computer.c:
    
    [ 70%] Building C object CMakeFiles/computer.dir/modules/computer.c.o
    In file included from /home/maxpayne/hardinfo/modules/computer.c:27:0:
    /home/maxpayne/hardinfo/modules/computer.c: In function ‘callback_os’:
    /home/maxpayne/hardinfo/modules/computer.c:421:30: warning: too many arguments for format [-Wformat-extra-args]
         return g_strdup_printf(_("[$ShellParam$]\n"
                                  ^
    /home/maxpayne/hardinfo/includes/hardinfo.h:28:30: note: in definition of macro ‘_’
     #define _(STRING)    gettext(STRING)
                                  ^
  3. Fixed compile warning in benchmark.c

    TotalCaesar659 authored and lpereira committed Apr 10, 2017
    There was compile warning in benchmark.c:
    
    Scanning dependencies of target benchmark
    [ 48%] Building C object CMakeFiles/benchmark.dir/modules/benchmark.c.o
    /home/maxpayne/hardinfo/modules/benchmark.c: In function ‘get_benchmark_results’:
    /home/maxpayne/hardinfo/modules/benchmark.c:565:37: warning: format ‘%d’ expects argument of type ‘int’, but argument 5 has type ‘long unsigned int’ [-Wformat=]
         gchar *result = g_strdup_printf("[param]\n"
                                         ^
    [ 50%] Building C object CMakeFiles/benchmark.dir/modules/benchmark/blowfish.c.o
  4. Updated Russian translation

    TotalCaesar659 authored and lpereira committed Apr 10, 2017
Commits on Apr 10, 2017
  1. Update ru.po

    TotalCaesar659 authored and lpereira committed Apr 9, 2017
  2. Update devices.c

    TotalCaesar659 authored and lpereira committed Apr 9, 2017
  3. Update ru.po

    TotalCaesar659 authored and lpereira committed Apr 9, 2017
  4. Update spd-decode.c

    TotalCaesar659 authored and lpereira committed Apr 9, 2017
  5. Fixed French translation

    TotalCaesar659 authored and lpereira committed Apr 9, 2017
    There was the message after compiling:
    
    [100%] Built target network
    /hardinfo/po/fr.po:410: 'msgid' and 'msgstr' entries do not both end with '\n'
    /usr/bin/msgfmt: found 1 fatal error
    po/CMakeFiles/i18n.dir/build.make:57: recipe for target 'i18n' failed
    make[2]: *** [i18n] Error 1
    CMakeFiles/Makefile2:308: recipe for target 'po/CMakeFiles/i18n.dir/all' failed
    make[1]: *** [po/CMakeFiles/i18n.dir/all] Error 2
    Makefile:127: recipe for target 'all' failed
    make: *** [all] Error 2
Commits on Apr 9, 2017
  1. Update fbench.c

    TotalCaesar659 authored and lpereira committed Dec 28, 2016