Skip to content

HTTPS clone URL

Subversion checkout URL

You can clone with HTTPS or Subversion.

Download ZIP
branch: master
Fetching contributors…

Cannot retrieve contributors at this time

821 lines (797 sloc) 25.978 kb
This file contains any messages produced by compilers while
running configure, to aid debugging if configure makes a mistake.
It was created by libcstl configure 2.0.2, which was
generated by GNU Autoconf 2.66. Invocation command line was
$ ./configure --with-memory-management
## --------- ##
## Platform. ##
## --------- ##
hostname = ActiveSys
uname -m = i686
uname -r = 2.6.35.14-95.fc14.i686
uname -s = Linux
uname -v = #1 SMP Tue Aug 16 21:30:14 UTC 2011
/usr/bin/uname -p = unknown
/bin/uname -X = unknown
/bin/arch = i686
/usr/bin/arch -k = unknown
/usr/convex/getsysinfo = unknown
/usr/bin/hostinfo = unknown
/bin/machine = unknown
/usr/bin/oslevel = unknown
/bin/universe = unknown
PATH: /usr/lib/qt-3.3/bin
PATH: /usr/lib/ccache
PATH: /usr/local/bin
PATH: /bin
PATH: /usr/bin
PATH: /usr/local/sbin
PATH: /usr/sbin
PATH: /sbin
PATH: /home/wb/bin
## ----------- ##
## Core tests. ##
## ----------- ##
configure:2295: checking for a BSD-compatible install
configure:2363: result: /usr/bin/install -c
configure:2374: checking whether build environment is sane
configure:2424: result: yes
configure:2565: checking for a thread-safe mkdir -p
configure:2604: result: /bin/mkdir -p
configure:2617: checking for gawk
configure:2633: found /bin/gawk
configure:2644: result: gawk
configure:2655: checking whether make sets $(MAKE)
configure:2677: result: yes
configure:2810: checking for gcc
configure:2826: found /usr/lib/ccache/gcc
configure:2837: result: gcc
configure:3066: checking for C compiler version
configure:3075: gcc --version >&5
gcc (GCC) 4.5.1 20100924 (Red Hat 4.5.1-4)
Copyright (C) 2010 Free Software Foundation, Inc.
This is free software; see the source for copying conditions. There is NO
warranty; not even for MERCHANTABILITY or FITNESS FOR A PARTICULAR PURPOSE.
configure:3086: $? = 0
configure:3075: gcc -v >&5
Using built-in specs.
COLLECT_GCC=/usr/bin/gcc
COLLECT_LTO_WRAPPER=/usr/libexec/gcc/i686-redhat-linux/4.5.1/lto-wrapper
Target: i686-redhat-linux
Configured with: ../configure --prefix=/usr --mandir=/usr/share/man --infodir=/usr/share/info --with-bugurl=http://bugzilla.redhat.com/bugzilla --enable-bootstrap --enable-shared --enable-threads=posix --enable-checking=release --with-system-zlib --enable-__cxa_atexit --disable-libunwind-exceptions --enable-gnu-unique-object --enable-linker-build-id --enable-languages=c,c++,objc,obj-c++,java,fortran,ada,lto --enable-plugin --enable-java-awt=gtk --disable-dssi --with-java-home=/usr/lib/jvm/java-1.5.0-gcj-1.5.0.0/jre --enable-libgcj-multifile --enable-java-maintainer-mode --with-ecj-jar=/usr/share/java/eclipse-ecj.jar --disable-libjava-multilib --with-ppl --with-cloog --with-tune=generic --with-arch=i686 --build=i686-redhat-linux
Thread model: posix
gcc version 4.5.1 20100924 (Red Hat 4.5.1-4) (GCC)
configure:3086: $? = 0
configure:3075: gcc -V >&5
gcc: '-V' option must have argument
configure:3086: $? = 1
configure:3075: gcc -qversion >&5
gcc: unrecognized option '-qversion'
gcc: no input files
configure:3086: $? = 1
configure:3106: checking whether the C compiler works
configure:3128: gcc conftest.c >&5
configure:3132: $? = 0
configure:3180: result: yes
configure:3183: checking for C compiler default output file name
configure:3185: result: a.out
configure:3191: checking for suffix of executables
configure:3198: gcc -o conftest conftest.c >&5
configure:3202: $? = 0
configure:3224: result:
configure:3246: checking whether we are cross compiling
configure:3254: gcc -o conftest conftest.c >&5
configure:3258: $? = 0
configure:3265: ./conftest
configure:3269: $? = 0
configure:3284: result: no
configure:3289: checking for suffix of object files
configure:3311: gcc -c conftest.c >&5
configure:3315: $? = 0
configure:3336: result: o
configure:3340: checking whether we are using the GNU C compiler
configure:3359: gcc -c conftest.c >&5
configure:3359: $? = 0
configure:3368: result: yes
configure:3377: checking whether gcc accepts -g
configure:3397: gcc -c -g conftest.c >&5
configure:3397: $? = 0
configure:3438: result: yes
configure:3455: checking for gcc option to accept ISO C89
configure:3519: gcc -c -g -O2 conftest.c >&5
configure:3519: $? = 0
configure:3532: result: none needed
configure:3563: checking for style of include used by make
configure:3591: result: GNU
configure:3616: checking dependency style of gcc
configure:3726: result: gcc3
configure:3784: checking for ranlib
configure:3800: found /usr/bin/ranlib
configure:3811: result: ranlib
configure:3862: checking build system type
configure:3876: result: i686-pc-linux-gnu
configure:3896: checking host system type
configure:3909: result: i686-pc-linux-gnu
configure:3950: checking how to print strings
configure:3977: result: printf
configure:3998: checking for a sed that does not truncate output
configure:4062: result: /bin/sed
configure:4080: checking for grep that handles long lines and -e
configure:4138: result: /bin/grep
configure:4143: checking for egrep
configure:4205: result: /bin/grep -E
configure:4210: checking for fgrep
configure:4272: result: /bin/grep -F
configure:4307: checking for ld used by gcc
configure:4374: result: /usr/bin/ld
configure:4381: checking if the linker (/usr/bin/ld) is GNU ld
configure:4396: result: yes
configure:4408: checking for BSD- or MS-compatible name lister (nm)
configure:4457: result: /usr/bin/nm -B
configure:4587: checking the name lister (/usr/bin/nm -B) interface
configure:4594: gcc -c -g -O2 conftest.c >&5
configure:4597: /usr/bin/nm -B "conftest.o"
configure:4600: output
00000000 B some_variable
configure:4607: result: BSD nm
configure:4610: checking whether ln -s works
configure:4614: result: yes
configure:4622: checking the maximum length of command line arguments
configure:4747: result: 1572864
configure:4764: checking whether the shell understands some XSI constructs
configure:4774: result: yes
configure:4778: checking whether the shell understands "+="
configure:4784: result: yes
configure:4819: checking for /usr/bin/ld option to reload object files
configure:4826: result: -r
configure:4895: checking for objdump
configure:4911: found /usr/bin/objdump
configure:4922: result: objdump
configure:4954: checking how to recognize dependent libraries
configure:5156: result: pass_all
configure:5216: checking for ar
configure:5232: found /usr/bin/ar
configure:5243: result: ar
configure:5321: checking for strip
configure:5337: found /usr/bin/strip
configure:5348: result: strip
configure:5420: checking for ranlib
configure:5447: result: ranlib
configure:5549: checking command to parse /usr/bin/nm -B output from gcc object
configure:5667: gcc -c -g -O2 conftest.c >&5
configure:5670: $? = 0
configure:5674: /usr/bin/nm -B conftest.o \| sed -n -e 's/^.*[ ]\([ABCDGIRSTW][ABCDGIRSTW]*\)[ ][ ]*\([_A-Za-z][_A-Za-z0-9]*\)$/\1 \2 \2/p' \> conftest.nm
configure:5677: $? = 0
configure:5731: gcc -o conftest -g -O2 conftest.c conftstm.o >&5
configure:5734: $? = 0
configure:5772: result: ok
configure:6613: checking how to run the C preprocessor
configure:6644: gcc -E conftest.c
configure:6644: $? = 0
configure:6658: gcc -E conftest.c
conftest.c:11:28: fatal error: ac_nonexistent.h: No such file or directory
compilation terminated.
configure:6658: $? = 1
configure: failed program was:
| /* confdefs.h */
| #define PACKAGE_NAME "libcstl"
| #define PACKAGE_TARNAME "libcstl"
| #define PACKAGE_VERSION "2.0.2"
| #define PACKAGE_STRING "libcstl 2.0.2"
| #define PACKAGE_BUGREPORT "activesys.wb@gmail.com"
| #define PACKAGE_URL ""
| #define PACKAGE "libcstl"
| #define VERSION "2.0.2"
| /* end confdefs.h. */
| #include <ac_nonexistent.h>
configure:6683: result: gcc -E
configure:6703: gcc -E conftest.c
configure:6703: $? = 0
configure:6717: gcc -E conftest.c
conftest.c:11:28: fatal error: ac_nonexistent.h: No such file or directory
compilation terminated.
configure:6717: $? = 1
configure: failed program was:
| /* confdefs.h */
| #define PACKAGE_NAME "libcstl"
| #define PACKAGE_TARNAME "libcstl"
| #define PACKAGE_VERSION "2.0.2"
| #define PACKAGE_STRING "libcstl 2.0.2"
| #define PACKAGE_BUGREPORT "activesys.wb@gmail.com"
| #define PACKAGE_URL ""
| #define PACKAGE "libcstl"
| #define VERSION "2.0.2"
| /* end confdefs.h. */
| #include <ac_nonexistent.h>
configure:6746: checking for ANSI C header files
configure:6766: gcc -c -g -O2 conftest.c >&5
configure:6766: $? = 0
configure:6839: gcc -o conftest -g -O2 conftest.c >&5
configure:6839: $? = 0
configure:6839: ./conftest
configure:6839: $? = 0
configure:6850: result: yes
configure:6863: checking for sys/types.h
configure:6863: gcc -c -g -O2 conftest.c >&5
configure:6863: $? = 0
configure:6863: result: yes
configure:6863: checking for sys/stat.h
configure:6863: gcc -c -g -O2 conftest.c >&5
configure:6863: $? = 0
configure:6863: result: yes
configure:6863: checking for stdlib.h
configure:6863: gcc -c -g -O2 conftest.c >&5
configure:6863: $? = 0
configure:6863: result: yes
configure:6863: checking for string.h
configure:6863: gcc -c -g -O2 conftest.c >&5
configure:6863: $? = 0
configure:6863: result: yes
configure:6863: checking for memory.h
configure:6863: gcc -c -g -O2 conftest.c >&5
configure:6863: $? = 0
configure:6863: result: yes
configure:6863: checking for strings.h
configure:6863: gcc -c -g -O2 conftest.c >&5
configure:6863: $? = 0
configure:6863: result: yes
configure:6863: checking for inttypes.h
configure:6863: gcc -c -g -O2 conftest.c >&5
configure:6863: $? = 0
configure:6863: result: yes
configure:6863: checking for stdint.h
configure:6863: gcc -c -g -O2 conftest.c >&5
configure:6863: $? = 0
configure:6863: result: yes
configure:6863: checking for unistd.h
configure:6863: gcc -c -g -O2 conftest.c >&5
configure:6863: $? = 0
configure:6863: result: yes
configure:6877: checking for dlfcn.h
configure:6877: gcc -c -g -O2 conftest.c >&5
configure:6877: $? = 0
configure:6877: result: yes
configure:7064: checking for objdir
configure:7079: result: .libs
configure:7346: checking if gcc supports -fno-rtti -fno-exceptions
configure:7364: gcc -c -g -O2 -fno-rtti -fno-exceptions conftest.c >&5
cc1: warning: command line option "-fno-rtti" is valid for C++/ObjC++ but not for C
cc1: warning: command line option "-fno-rtti" is valid for C++/ObjC++ but not for C
configure:7368: $? = 0
configure:7381: result: no
configure:7401: checking for gcc option to produce PIC
configure:7686: result: -fPIC -DPIC
configure:7698: checking if gcc PIC flag -fPIC -DPIC works
configure:7716: gcc -c -g -O2 -fPIC -DPIC -DPIC conftest.c >&5
configure:7720: $? = 0
configure:7733: result: yes
configure:7757: checking if gcc static flag -static works
configure:7785: result: no
configure:7800: checking if gcc supports -c -o file.o
configure:7821: gcc -c -g -O2 -o out/conftest2.o conftest.c >&5
configure:7825: $? = 0
configure:7847: result: yes
configure:7855: checking if gcc supports -c -o file.o
configure:7902: result: yes
configure:7935: checking whether the gcc linker (/usr/bin/ld) supports shared libraries
configure:9010: result: yes
configure:9047: checking whether -lc should be explicitly linked in
configure:9055: gcc -c -g -O2 conftest.c >&5
configure:9058: $? = 0
configure:9073: gcc -shared conftest.o -v -Wl,-soname -Wl,conftest -o conftest 2\>\&1 \| /bin/grep -lc \>/dev/null 2\>\&1
configure:9076: $? = 0
configure:9090: result: no
configure:9255: checking dynamic linker characteristics
configure:9710: gcc -o conftest -g -O2 -Wl,-rpath -Wl,/foo conftest.c >&5
configure:9710: $? = 0
configure:9936: result: GNU/Linux ld.so
configure:10043: checking how to hardcode library paths into programs
configure:10068: result: immediate
configure:10608: checking whether stripping libraries is possible
configure:10613: result: yes
configure:10648: checking if libtool supports shared libraries
configure:10650: result: yes
configure:10653: checking whether to build shared libraries
configure:10674: result: yes
configure:10677: checking whether to build static libraries
configure:10681: result: yes
configure:10721: checking whether to enable assertions
configure:10739: result: yes
configure:10744: checking for size_t
configure:10744: gcc -c -g -O2 conftest.c >&5
configure:10744: $? = 0
configure:10744: gcc -c -g -O2 conftest.c >&5
conftest.c: In function 'main':
conftest.c:59:21: error: expected expression before ')' token
configure:10744: $? = 1
configure: failed program was:
| /* confdefs.h */
| #define PACKAGE_NAME "libcstl"
| #define PACKAGE_TARNAME "libcstl"
| #define PACKAGE_VERSION "2.0.2"
| #define PACKAGE_STRING "libcstl 2.0.2"
| #define PACKAGE_BUGREPORT "activesys.wb@gmail.com"
| #define PACKAGE_URL ""
| #define PACKAGE "libcstl"
| #define VERSION "2.0.2"
| #define STDC_HEADERS 1
| #define HAVE_SYS_TYPES_H 1
| #define HAVE_SYS_STAT_H 1
| #define HAVE_STDLIB_H 1
| #define HAVE_STRING_H 1
| #define HAVE_MEMORY_H 1
| #define HAVE_STRINGS_H 1
| #define HAVE_INTTYPES_H 1
| #define HAVE_STDINT_H 1
| #define HAVE_UNISTD_H 1
| #define HAVE_DLFCN_H 1
| #define LT_OBJDIR ".libs/"
| /* end confdefs.h. */
| #include <stdio.h>
| #ifdef HAVE_SYS_TYPES_H
| # include <sys/types.h>
| #endif
| #ifdef HAVE_SYS_STAT_H
| # include <sys/stat.h>
| #endif
| #ifdef STDC_HEADERS
| # include <stdlib.h>
| # include <stddef.h>
| #else
| # ifdef HAVE_STDLIB_H
| # include <stdlib.h>
| # endif
| #endif
| #ifdef HAVE_STRING_H
| # if !defined STDC_HEADERS && defined HAVE_MEMORY_H
| # include <memory.h>
| # endif
| # include <string.h>
| #endif
| #ifdef HAVE_STRINGS_H
| # include <strings.h>
| #endif
| #ifdef HAVE_INTTYPES_H
| # include <inttypes.h>
| #endif
| #ifdef HAVE_STDINT_H
| # include <stdint.h>
| #endif
| #ifdef HAVE_UNISTD_H
| # include <unistd.h>
| #endif
| int
| main ()
| {
| if (sizeof ((size_t)))
| return 0;
| ;
| return 0;
| }
configure:10744: result: yes
configure:10755: checking for gcc option to accept ISO C99
configure:10904: gcc -c -g -O2 conftest.c >&5
conftest.c:73:29: error: expected ';', ',' or ')' before 'text'
conftest.c: In function 'main':
conftest.c:127:18: error: expected '=', ',', ';', 'asm' or '__attribute__' before 'newvar'
conftest.c:127:18: error: 'newvar' undeclared (first use in this function)
conftest.c:127:18: note: each undeclared identifier is reported only once for each function it appears in
conftest.c:137:3: error: 'for' loop initial declarations are only allowed in C99 mode
conftest.c:137:3: note: use option -std=c99 or -std=gnu99 to compile your code
configure:10904: $? = 1
configure: failed program was:
| /* confdefs.h */
| #define PACKAGE_NAME "libcstl"
| #define PACKAGE_TARNAME "libcstl"
| #define PACKAGE_VERSION "2.0.2"
| #define PACKAGE_STRING "libcstl 2.0.2"
| #define PACKAGE_BUGREPORT "activesys.wb@gmail.com"
| #define PACKAGE_URL ""
| #define PACKAGE "libcstl"
| #define VERSION "2.0.2"
| #define STDC_HEADERS 1
| #define HAVE_SYS_TYPES_H 1
| #define HAVE_SYS_STAT_H 1
| #define HAVE_STDLIB_H 1
| #define HAVE_STRING_H 1
| #define HAVE_MEMORY_H 1
| #define HAVE_STRINGS_H 1
| #define HAVE_INTTYPES_H 1
| #define HAVE_STDINT_H 1
| #define HAVE_UNISTD_H 1
| #define HAVE_DLFCN_H 1
| #define LT_OBJDIR ".libs/"
| /* end confdefs.h. */
| #include <stdarg.h>
| #include <stdbool.h>
| #include <stdlib.h>
| #include <wchar.h>
| #include <stdio.h>
|
| // Check varargs macros. These examples are taken from C99 6.10.3.5.
| #define debug(...) fprintf (stderr, __VA_ARGS__)
| #define showlist(...) puts (#__VA_ARGS__)
| #define report(test,...) ((test) ? puts (#test) : printf (__VA_ARGS__))
| static void
| test_varargs_macros (void)
| {
| int x = 1234;
| int y = 5678;
| debug ("Flag");
| debug ("X = %d\n", x);
| showlist (The first, second, and third items.);
| report (x>y, "x is %d but y is %d", x, y);
| }
|
| // Check long long types.
| #define BIG64 18446744073709551615ull
| #define BIG32 4294967295ul
| #define BIG_OK (BIG64 / BIG32 == 4294967297ull && BIG64 % BIG32 == 0)
| #if !BIG_OK
| your preprocessor is broken;
| #endif
| #if BIG_OK
| #else
| your preprocessor is broken;
| #endif
| static long long int bignum = -9223372036854775807LL;
| static unsigned long long int ubignum = BIG64;
|
| struct incomplete_array
| {
| int datasize;
| double data[];
| };
|
| struct named_init {
| int number;
| const wchar_t *name;
| double average;
| };
|
| typedef const char *ccp;
|
| static inline int
| test_restrict (ccp restrict text)
| {
| // See if C++-style comments work.
| // Iterate through items via the restricted pointer.
| // Also check for declarations in for loops.
| for (unsigned int i = 0; *(text+i) != '\0'; ++i)
| continue;
| return 0;
| }
|
| // Check varargs and va_copy.
| static void
| test_varargs (const char *format, ...)
| {
| va_list args;
| va_start (args, format);
| va_list args_copy;
| va_copy (args_copy, args);
|
| const char *str;
| int number;
| float fnumber;
|
| while (*format)
| {
| switch (*format++)
| {
| case 's': // string
| str = va_arg (args_copy, const char *);
| break;
| case 'd': // int
| number = va_arg (args_copy, int);
| break;
| case 'f': // float
| fnumber = va_arg (args_copy, double);
| break;
| default:
| break;
| }
| }
| va_end (args_copy);
| va_end (args);
| }
|
| int
| main ()
| {
|
| // Check bool.
| _Bool success = false;
|
| // Check restrict.
| if (test_restrict ("String literal") == 0)
| success = true;
| char *restrict newvar = "Another string";
|
| // Check varargs.
| test_varargs ("s, d' f .", "string", 65, 34.234);
| test_varargs_macros ();
|
| // Check flexible array members.
| struct incomplete_array *ia =
| malloc (sizeof (struct incomplete_array) + (sizeof (double) * 10));
| ia->datasize = 10;
| for (int i = 0; i < ia->datasize; ++i)
| ia->data[i] = i * 1.234;
|
| // Check named initializers.
| struct named_init ni = {
| .number = 34,
| .name = L"Test wide string",
| .average = 543.34343,
| };
|
| ni.number = 58;
|
| int dynamic_array[ni.number];
| dynamic_array[ni.number - 1] = 543;
|
| // work around unused variable warnings
| return (!success || bignum == 0LL || ubignum == 0uLL || newvar[0] == 'x'
| || dynamic_array[ni.number - 1] != 543);
|
| ;
| return 0;
| }
configure:10904: gcc -std=gnu99 -c -g -O2 conftest.c >&5
configure:10904: $? = 0
configure:10924: result: -std=gnu99
configure:10932: checking for an ANSI C-conforming const
configure:10997: gcc -std=gnu99 -c -g -O2 conftest.c >&5
configure:10997: $? = 0
configure:11004: result: yes
configure:11016: checking for stdlib.h
configure:11016: result: yes
configure:11026: checking for GNU libc compatible malloc
configure:11050: gcc -std=gnu99 -o conftest -g -O2 conftest.c >&5
configure:11050: $? = 0
configure:11050: ./conftest
configure:11050: $? = 0
configure:11060: result: yes
configure:11300: creating ./config.status
## ---------------------- ##
## Running config.status. ##
## ---------------------- ##
This file was extended by libcstl config.status 2.0.2, which was
generated by GNU Autoconf 2.66. Invocation command line was
CONFIG_FILES =
CONFIG_HEADERS =
CONFIG_LINKS =
CONFIG_COMMANDS =
$ ./config.status
on ActiveSys
config.status:1078: creating Makefile
config.status:1078: creating cstl/Makefile
config.status:1078: creating src/Makefile
config.status:1078: creating build-win/Makefile
config.status:1078: creating build-win/vc8/Makefile
config.status:1078: creating build-win/vc9/Makefile
config.status:1078: creating doc/Makefile
config.status:1078: creating doc/user/Makefile
config.status:1078: creating test/Makefile
config.status:1078: creating test/ut/Makefile
config.status:1078: creating test/it/Makefile
config.status:1078: creating config.h
config.status:1306: executing depfiles commands
config.status:1306: executing libtool commands
## ---------------- ##
## Cache variables. ##
## ---------------- ##
ac_cv_build=i686-pc-linux-gnu
ac_cv_c_compiler_gnu=yes
ac_cv_c_const=yes
ac_cv_env_CC_set=
ac_cv_env_CC_value=
ac_cv_env_CFLAGS_set=
ac_cv_env_CFLAGS_value=
ac_cv_env_CPPFLAGS_set=
ac_cv_env_CPPFLAGS_value=
ac_cv_env_CPP_set=
ac_cv_env_CPP_value=
ac_cv_env_LDFLAGS_set=
ac_cv_env_LDFLAGS_value=
ac_cv_env_LIBS_set=
ac_cv_env_LIBS_value=
ac_cv_env_build_alias_set=
ac_cv_env_build_alias_value=
ac_cv_env_host_alias_set=
ac_cv_env_host_alias_value=
ac_cv_env_target_alias_set=
ac_cv_env_target_alias_value=
ac_cv_func_malloc_0_nonnull=yes
ac_cv_header_dlfcn_h=yes
ac_cv_header_inttypes_h=yes
ac_cv_header_memory_h=yes
ac_cv_header_stdc=yes
ac_cv_header_stdint_h=yes
ac_cv_header_stdlib_h=yes
ac_cv_header_string_h=yes
ac_cv_header_strings_h=yes
ac_cv_header_sys_stat_h=yes
ac_cv_header_sys_types_h=yes
ac_cv_header_unistd_h=yes
ac_cv_host=i686-pc-linux-gnu
ac_cv_objext=o
ac_cv_path_EGREP='/bin/grep -E'
ac_cv_path_FGREP='/bin/grep -F'
ac_cv_path_GREP=/bin/grep
ac_cv_path_SED=/bin/sed
ac_cv_path_install='/usr/bin/install -c'
ac_cv_path_mkdir=/bin/mkdir
ac_cv_prog_AWK=gawk
ac_cv_prog_CPP='gcc -E'
ac_cv_prog_ac_ct_AR=ar
ac_cv_prog_ac_ct_CC=gcc
ac_cv_prog_ac_ct_OBJDUMP=objdump
ac_cv_prog_ac_ct_RANLIB=ranlib
ac_cv_prog_ac_ct_STRIP=strip
ac_cv_prog_cc_c89=
ac_cv_prog_cc_c99=-std=gnu99
ac_cv_prog_cc_g=yes
ac_cv_prog_make_make_set=yes
ac_cv_type_size_t=yes
am_cv_CC_dependencies_compiler_type=gcc3
lt_cv_archive_cmds_need_lc=no
lt_cv_deplibs_check_method=pass_all
lt_cv_file_magic_cmd='$MAGIC_CMD'
lt_cv_file_magic_test_file=
lt_cv_ld_reload_flag=-r
lt_cv_nm_interface='BSD nm'
lt_cv_objdir=.libs
lt_cv_path_LD=/usr/bin/ld
lt_cv_path_NM='/usr/bin/nm -B'
lt_cv_prog_compiler_c_o=yes
lt_cv_prog_compiler_pic_works=yes
lt_cv_prog_compiler_rtti_exceptions=no
lt_cv_prog_compiler_static_works=no
lt_cv_prog_gnu_ld=yes
lt_cv_shlibpath_overrides_runpath=no
lt_cv_sys_global_symbol_pipe='sed -n -e '\''s/^.*[ ]\([ABCDGIRSTW][ABCDGIRSTW]*\)[ ][ ]*\([_A-Za-z][_A-Za-z0-9]*\)$/\1 \2 \2/p'\'''
lt_cv_sys_global_symbol_to_c_name_address='sed -n -e '\''s/^: \([^ ]*\) $/ {\"\1\", (void *) 0},/p'\'' -e '\''s/^[ABCDGIRSTW]* \([^ ]*\) \([^ ]*\)$/ {"\2", (void *) \&\2},/p'\'''
lt_cv_sys_global_symbol_to_c_name_address_lib_prefix='sed -n -e '\''s/^: \([^ ]*\) $/ {\"\1\", (void *) 0},/p'\'' -e '\''s/^[ABCDGIRSTW]* \([^ ]*\) \(lib[^ ]*\)$/ {"\2", (void *) \&\2},/p'\'' -e '\''s/^[ABCDGIRSTW]* \([^ ]*\) \([^ ]*\)$/ {"lib\2", (void *) \&\2},/p'\'''
lt_cv_sys_global_symbol_to_cdecl='sed -n -e '\''s/^T .* \(.*\)$/extern int \1();/p'\'' -e '\''s/^[ABCDGIRSTW]* .* \(.*\)$/extern char \1;/p'\'''
lt_cv_sys_max_cmd_len=1572864
## ----------------- ##
## Output variables. ##
## ----------------- ##
ACLOCAL='${SHELL} /home/wb/project/libcstl/trunk/missing --run aclocal-1.11'
AMDEPBACKSLASH='\'
AMDEP_FALSE='#'
AMDEP_TRUE=''
AMTAR='${SHELL} /home/wb/project/libcstl/trunk/missing --run tar'
AR='ar'
AUTOCONF='${SHELL} /home/wb/project/libcstl/trunk/missing --run autoconf'
AUTOHEADER='${SHELL} /home/wb/project/libcstl/trunk/missing --run autoheader'
AUTOMAKE='${SHELL} /home/wb/project/libcstl/trunk/missing --run automake-1.11'
AWK='gawk'
CC='gcc -std=gnu99'
CCDEPMODE='depmode=gcc3'
CFLAGS='-g -O2'
CPP='gcc -E'
CPPFLAGS=''
CYGPATH_W='echo'
DEFS='-DHAVE_CONFIG_H'
DEPDIR='.deps'
DSYMUTIL=''
DUMPBIN=''
ECHO_C=''
ECHO_N='-n'
ECHO_T=''
EGREP='/bin/grep -E'
EXEEXT=''
FGREP='/bin/grep -F'
GREP='/bin/grep'
INSTALL_DATA='${INSTALL} -m 644'
INSTALL_PROGRAM='${INSTALL}'
INSTALL_SCRIPT='${INSTALL}'
INSTALL_STRIP_PROGRAM='$(install_sh) -c -s'
LD='/usr/bin/ld'
LDFLAGS=''
LIBOBJS=''
LIBS=''
LIBTOOL='$(SHELL) $(top_builddir)/libtool'
LIPO=''
LN_S='ln -s'
LTLIBOBJS=''
MAKEINFO='${SHELL} /home/wb/project/libcstl/trunk/missing --run makeinfo'
MKDIR_P='/bin/mkdir -p'
NM='/usr/bin/nm -B'
NMEDIT=''
OBJDUMP='objdump'
OBJEXT='o'
OTOOL64=''
OTOOL=''
PACKAGE='libcstl'
PACKAGE_BUGREPORT='activesys.wb@gmail.com'
PACKAGE_NAME='libcstl'
PACKAGE_STRING='libcstl 2.0.2'
PACKAGE_TARNAME='libcstl'
PACKAGE_URL=''
PACKAGE_VERSION='2.0.2'
PATH_SEPARATOR=':'
RANLIB='ranlib'
SED='/bin/sed'
SET_MAKE=''
SHELL='/bin/sh'
STRIP='strip'
VERSION='2.0.2'
ac_ct_CC='gcc'
ac_ct_DUMPBIN=''
am__EXEEXT_FALSE=''
am__EXEEXT_TRUE='#'
am__fastdepCC_FALSE='#'
am__fastdepCC_TRUE=''
am__include='include'
am__isrc=''
am__leading_dot='.'
am__quote=''
am__tar='${AMTAR} chof - "$$tardir"'
am__untar='${AMTAR} xf -'
bindir='${exec_prefix}/bin'
build='i686-pc-linux-gnu'
build_alias=''
build_cpu='i686'
build_os='linux-gnu'
build_vendor='pc'
datadir='${datarootdir}'
datarootdir='${prefix}/share'
docdir='${datarootdir}/doc/${PACKAGE_TARNAME}'
dvidir='${docdir}'
exec_prefix='${prefix}'
host='i686-pc-linux-gnu'
host_alias=''
host_cpu='i686'
host_os='linux-gnu'
host_vendor='pc'
htmldir='${docdir}'
includedir='${prefix}/include'
infodir='${datarootdir}/info'
install_sh='${SHELL} /home/wb/project/libcstl/trunk/install-sh'
libdir='${exec_prefix}/lib'
libexecdir='${exec_prefix}/libexec'
localedir='${datarootdir}/locale'
localstatedir='${prefix}/var'
mandir='${datarootdir}/man'
mkdir_p='/bin/mkdir -p'
oldincludedir='/usr/include'
pdfdir='${docdir}'
prefix='/usr/local'
program_transform_name='s,x,x,'
psdir='${docdir}'
sbindir='${exec_prefix}/sbin'
sharedstatedir='${prefix}/com'
sysconfdir='${prefix}/etc'
target_alias=''
## ----------- ##
## confdefs.h. ##
## ----------- ##
/* confdefs.h */
#define PACKAGE_NAME "libcstl"
#define PACKAGE_TARNAME "libcstl"
#define PACKAGE_VERSION "2.0.2"
#define PACKAGE_STRING "libcstl 2.0.2"
#define PACKAGE_BUGREPORT "activesys.wb@gmail.com"
#define PACKAGE_URL ""
#define PACKAGE "libcstl"
#define VERSION "2.0.2"
#define STDC_HEADERS 1
#define HAVE_SYS_TYPES_H 1
#define HAVE_SYS_STAT_H 1
#define HAVE_STDLIB_H 1
#define HAVE_STRING_H 1
#define HAVE_MEMORY_H 1
#define HAVE_STRINGS_H 1
#define HAVE_INTTYPES_H 1
#define HAVE_STDINT_H 1
#define HAVE_UNISTD_H 1
#define HAVE_DLFCN_H 1
#define LT_OBJDIR ".libs/"
#define HAVE_STDLIB_H 1
#define HAVE_MALLOC 1
#define CSTL_MEMORY_MANAGEMENT 1
configure: exit 0
Jump to Line
Something went wrong with that request. Please try again.